{"text_format":"1","workbook":"xlsx","n_sheets":13,"sheets":["Instr Refs Auths","Irrigation System Information ","ETo, Soil, C.C., Irr Info.","Catch Can Field Worksheet","drop down list menus","Sheet5","Irrig Summary","Irrig Calendar","ETo Zones Map","SOIL INFORMATION","DU CALCS \"mL.\"","DAILY ETo","Irrig Sched"],"not_rendered":{"charts":0,"images":10,"macros":1,"external_links":0,"defined_names":61,"comments":1,"pivot_tables":0},"unopened":[],"bounds":{"document_bytes":16777216,"sheet_cells":100000,"rows_first":2000,"rows_last":500,"rows_between":2000,"halvings":0,"cell_chars":16384,"cell_head_chars":4096},"cells_cut":0,"cells_raw":0,"read":"whole","date_system":"1900"}

{"sheet":"Instr Refs Auths","index":0,"n_rows":67,"n_cols":2,"rows_kept":67,"cut":false,"hidden":false,"merged":[[15,0,15,5],[11,0,11,5],[12,0,12,5],[8,0,8,5],[7,0,7,5],[9,0,9,5],[10,0,10,5]]}
[]
[]
[]
[]
[]
["Brief instructions"]
[]
["Note that, except for the first page (Irrigation System Information), entries in the green boxes are required.  Entries in the blue boxes are optional.  All entries in the first page are optional."]
["Start in the irrigation System Information tab and enter information about the condition of the irrigation system."]
["In the ETo, Soil, C.C., Irr tab, enter the location, select the ETo zone in the pull down list.  Refer to the map on the ETo Zones Map page to identify your ETo zone.  In the Soil Texture section, Select the soil type in the pull down list.  If you don't know the soil texture, try using the app \"SoilWeb\" on your smartphone or computer.  Enter the throat area of the catch cans you used in the irrigation assessment.  In the irrigation section, enter the year for the irrigaiton schedule you would like to produce.  Enter the desired depth the soil should be wetted.  If irrigation is restricted to specific days of the week, indicate those days irrigation is allowed.  "]
["In the Catch Can Field Worksheet, Enter the run time the valve was on during this test.  Enter the landscape coefficient (KL) of the irrigation zone.  If there was runoff, enter the number of minutes the valve was when the runoff occurred.   Enter the volumes of water collected in the catch cans in the Catch Can Measurements section.  Measure the volumes in milliliters (mL).  Remember to use at least 24 catch cans and in multiples of 4.  Leave unused boxes blank.  There will be a \"Targeted capture volume\" calculated based on the throat area you entered in the previous page.  Use this volume as a guide only.  Be sure to not overflow any of the catch cans.  Use the grid in th elower section to draw a map of the irrigation zone.  This can be helpful in locating problem sprinklers or emitters. "]
["The Irrigation Summary page includes information entered in previous pages and calculation results from the catch can test.  Some of this would be used in programming irrigation controllers.  Specifically these are the \"Run Time per Cycle\" and the \"Number of Cycles\".  The run time is the duration the valve was on before runoff was generated.  A 1 hour interval between cycles is easiest to program, but may be determined by the total duration of the program if it is longer than an hour."]
["The Irrig Calendar displays the days of the year when the irrigation program should run.  These dates consider days irrigation is allowed, historical weather, and rain events (if rain information is entered)."]
["To print all sheets, use Crtl-Shift-A."]
["To print the instructions, use Ctrl-Shift-I."]
["To print the Irrigation system info; ETo, Soil, CC, Irr Info; and Catch Can Field Worksheets only, use Ctrl-Shift-S."]
["To print the Irrig Summary and Irrig Calendar sheets only, use Ctrl-Shift-C."]
["If the macros are not working, try closing the spreadsheet, then reopen and \"Enable Macros\"."]
[]
["Please contact Loren Oki should you have issues to report (lroki@ucdavis.edu)."]
[]
[]
[]
[]
[]
[]
[]
[]
["References"]
[]
["Costello, L.R. and K.S. Jones. 2014. Water Use Classifications of Landscape Species. WUCOLS IV. "]
["California Department of Water Resources, the University of California, and the California Center for "]
["Urban Horticulture (UC Davis). http://ucanr.edu/sites/WUCOLS/."]
["http://ucanr.edu/sites/WUCOLS/"]
[]
["Landscape Irrigation Auditor Second Edition. 2011. Irrigation Association. Falls Church, VA"]
[]
["McCabe, J. (ed). 2010. Turf and landscape irrigation best management practices. Irrigation"]
["Association Water Management Committee."]
["http://www.irrigation.org/uploadedFiles/Resources/BMP_Revised_12-2010.pdf"]
[]
["Shaw, D.A. and D.R. Pittenger. 2009. Landscape irrigation system evaluation and management.  "]
["University of California, Cooperative Extension."]
["http://ucanr.org/sites/urbanhort/files/80223.pdf"]
[]
[]
[]
["Authors"]
[]
["Lorence R. Oki, Ph.D.","Darren Haver, Ph.D."]
["Associate Specialist in Cooperative Extension","Water Resources/Water Quality Advisor"]
["Department of Plant Sciences, MS6","Director of South Coast REC and UCCE Orange"]
["One Shields Avenue","South Coast Research & Extension Center"]
["1110 Env Hort","7601 Irvine Blvd."]
["Davis, CA 95616-8587","Irvine, CA 92618"]
["(530) 754-4135","(949) 653-1814"]
["lroki@ucdavis.edu","dlhaver@ucanr.edu"]
[]
[]
["The original version of this worksheet was developed for the Orange County Parks by:"]
[]
["Darren Haver, Ph.D. and"]
["Rene Orta, Grant Johnson, and Corey Harris"]
["Staff Research Associates"]
["South Coast Research & Extension Center"]
[]
["version 1.20  March 16, 2015"]

{"sheet":"Irrigation System Information ","index":1,"n_rows":30,"n_cols":7,"rows_kept":30,"cut":false,"hidden":false,"merged":[[30,0,30,2],[31,0,31,2],[32,0,32,2],[33,0,33,2],[34,0,34,2],[6,1,6,2],[7,1,7,2],[6,5,6,6],[10,1,10,2],[11,1,11,2],[10,5,10,6],[22,1,22,2],[23,1,23,2],[22,5,22,6],[23,5,23,6],[14,1,14,2],[15,1,15,2],[14,5,14,6],[15,5,15,6],[18,1,18,2],[19,1,19,2],[18,5,18,6],[19,5,19,6]]}
[]
[]
["Irrigation system Information"]
["Record irrigation system zone information"]
[]
[]
["Zone name:","Test zone 12",null,null,"Evaluator(s):","Auditor XYZ"]
["Date:","19/25/2014"]
[]
[]
["Controller Model:","WaterManager X2",null,null,"Station #:","Turf west"]
["Program #:","Test program 12"]
[]
[]
["Valve Model:",null,null,null,"Emitter:"]
["GPM:",null,null,null,"Working pressure (psi):"]
[]
[]
["Valve conditions:",null,null,null,"Wiring:"]
["Is valve tagged?",null,null,null,"Tag Number:"]
[]
[]
["Grass type:",null,null,null,"Weeds:"]
["Trees:",null,null,null,"Shrubs:"]
[]
[]
["Broken Components","Head/Nozzles not similar","MPR's","Clogged nozzle or emitter","Spray Misdirected","Heads not vertical","Heads not turning"]
["Spray blocked","Wrong Pattern  (¼-½-Full)","Sunken Heads","Pressure reguation used","Unequal pressure","Over Spray "]
[]
["Picture File Names:"]

{"sheet":"ETo, Soil, C.C., Irr Info.","index":2,"n_rows":36,"n_cols":10,"rows_kept":36,"cut":false,"hidden":false,"merged":[[25,9,25,10],[21,9,24,10],[20,4,24,6],[23,2,23,3],[19,0,22,1],[23,0,24,1],[10,2,10,3],[5,0,5,1],[4,0,4,1],[1,0,1,11],[4,4,7,11],[4,2,4,3],[14,0,14,1],[15,2,15,3],[19,2,19,3],[14,6,14,7],[14,2,14,3],[15,4,15,5],[15,6,15,7],[16,4,19,5],[14,4,14,5]]}
["ETo Zone, Soil Texture, and Catch Can Type Worksheet "]
["Determine values for each of the sections below and enter values into the fields provided.    \nNote:  fields highlighted in  green must be filled out in order for other calculations in the spread sheet to work properly"]
["ETo Zone"]
[]
["Location: ",null,"Davis",null,"Find the ETo zone of your location on the ETo Zones Map tab of this worksheet.  Then, select the zone number from the drop down list (to the left of this text).  Enter the name of the location in the space provided."]
["ETo Zone: ",null,14]
[]
[]
["Soil Texture"]
[]
[null,"Soil Texture: ","sandy loam",null,"  Select the soil texture from the drop down list"]
[]
["Commonly Used Catch Cans"]
[]
["Type",null,"Throat\narea (sq. in) ",null,"Type",null,"Throat\narea (sq. in) "]
["Cal Poly",null,16.600000000000001,null,"Tuna Can (3 ¼\" dia)",null,8.3000000000000007]
[null,null,null,null,"Measure the can diameter to verify this. "]
[]
[]
["US Bureau of Reclamation",null,14.2]
[null,null,null,null,"If catch can type is unknown, enter the diameter in the box  below in inches.  The throat area will be calculated."]
[null,null,null,null,null,null,null,null,null,"Enter the throat area of the catch can used below:"]
[]
["Texas Aggies",null,16.600000000000001]
[]
[null,null,null,null,null,null,"Dia of container (in.): ",5,null,16.600000000000001]
[null,null,null,null,null,null,"Throat area (sq.in.): ",{"$f":"(H26/2)^2*3.14159","v":19.634937499999999}]
[]
["Irrigation information"]
[]
[null,null,"Irrigation schedule for year:  ",2017]
[]
[null,null,"Depth to wet:  ",12,"inches","The recommended depth to wet for turf is 12 inches."]
[]
["Select the days of the week irrigation is allowed.  A check mark indicates that irrigation is allowed on that day."]
["If there are no restrictions, make sure all of the boxes are checked."]

{"sheet":"Catch Can Field Worksheet","index":3,"n_rows":23,"n_cols":12,"rows_kept":23,"cut":false,"hidden":false,"merged":[[21,9,22,11],[17,9,18,11],[19,9,19,11],[1,0,1,11],[7,5,8,10],[5,9,6,11],[12,9,15,11]]}
["Catch Can Field Worksheet "]
["Determine values for each of the sections below and enter values into the fields provided.    \nNote:  fields highlighted in  green must be filled out in order for other calculations in the spread sheet to work properly ."]
[null,null,null,"Valve turned on: ","Manually / Controller",null,null,null,null,null,"Wind(mph):"]
[null,null,null,"Valve turned on: ",null,"          :"," am / pm",null,null,null,"Number of catch cans:",{"$f":"COUNT(B13:B22)+COUNT(D13:D22)+COUNT(F13:F22)+COUNT(H13:H22)","v":40}]
[null,null,null,"Valve turned off: ",null,"          :"," am / pm",null,null,null,"Zone KL or KS:",0.6]
[null,null,null,"Actual Run time:  ",null,6," minutes",null,null,"(Landscape coefficient, KL, \nor species coefficient, KS)"]
[]
[null,null,null,null,null,"Determine how many minutes it takes to generate  runoff.  If there was no runoff, leave blank :"]
[null,null,"Did runoff occur?: "," Yes /  No",null,null,null,null,null,null,null,12]
[null,null,null,null,null,null,null,null,null,null,null,31]
["Catch Can Measurements (in mL)"]
[]
[1,35,11,15,21,25,31,25,null,"Use at least 24 catch cans and in multiples of 4.  Be sure to measure the volume in  milliliters (mL).  Measuring to the nearest 5 mL is sufficient."]
[2,30,12,20,22,30,32,25]
[3,20,13,40,23,40,33,30]
[4,20,14,25,24,30,34,30]
[5,25,15,35,25,40,35,10]
[6,35,16,25,26,30,36,30,null,"Try to collect the volume indicated below.  Do not overflow the continer."]
[7,15,17,30,27,30,37,20]
[8,20,18,30,28,30,38,25,null,{"$f":"CONCATENATE(\"Targeted capture volume = \",ROUNDUP(Throat_area*1.5,0),\" mL.\")","v":"Targeted capture volume = 25 mL."}]
[9,40,19,40,29,20,39,20]
[10,20,20,40,30,20,40,30,null,"Use the chart below to map the sprinklers and record your catch can set up."]
["Diagram:"]

{"sheet":"drop down list menus","index":4,"n_rows":45,"n_cols":19,"rows_kept":45,"cut":false,"hidden":true,"merged":[]}
[null,null,"Inches",null,null,null,null,null,null,null,null,null,null,null,null,"Used for Ranking",null,null,"Used for Ranking"]
["Controller",null,"ml",null,"Yes",null,"Very Good",null,null,null,null,"Annual ryegrass",null,null,null,{"$f":"IF(#REF!<>\"\",#REF!+#REF!/1000,\"\")","v":{"$error":"#REF!"}},null,null,{"$f":"IF(#REF!<>\"\",#REF!+#REF!/1000,\"\")","v":{"$error":"#REF!"}}]
["Manually",null,"Ounces",null,"No",null,"Good",null,null,null,null,"Bermudagrass",null,null,null,{"$f":"IF(#REF!<>\"\",#REF!+#REF!/1000,\"\")","v":{"$error":"#REF!"}},null,null,{"$f":"IF(#REF!<>\"\",#REF!+#REF!/1000,\"\")","v":{"$error":"#REF!"}}]
[null,null,"cm",null,null,null,"Average",null,null,null,null,"Kentucky bluegrass",null,null,null,{"$f":"IF(#REF!<>\"\",#REF!+#REF!/1000,\"\")","v":{"$error":"#REF!"}},null,null,{"$f":"IF(#REF!<>\"\",#REF!+#REF!/1000,\"\")","v":{"$error":"#REF!"}}]
[null,null,null,null,null,null,"Bad",null,null,null,null,"Kikuyugrass",null,null,null,{"$f":"IF(#REF!<>\"\",#REF!+#REF!/1000,\"\")","v":{"$error":"#REF!"}},null,null,{"$f":"IF(#REF!<>\"\",#REF!+#REF!/1000,\"\")","v":{"$error":"#REF!"}}]
[null,null,null,null,null,null,"Very bad",null,null,null,null,"Perennial ryegrass ",null,null,null,{"$f":"IF(#REF!<>\"\",#REF!+#REF!/1000,\"\")","v":{"$error":"#REF!"}},null,null,{"$f":"IF(#REF!<>\"\",#REF!+#REF!/1000,\"\")","v":{"$error":"#REF!"}}]
[null,null,null,null,null,null,null,null,null,null,null,"St. Augustine",null,null,null,{"$f":"IF(#REF!<>\"\",#REF!+#REF!/1000,\"\")","v":{"$error":"#REF!"}},null,null,{"$f":"IF(#REF!<>\"\",#REF!+#REF!/1000,\"\")","v":{"$error":"#REF!"}}]
[null,null,null,null,null,null,null,null,null,null,null,"Tall Fescue",null,null,null,{"$f":"IF(#REF!<>\"\",#REF!+#REF!/1000,\"\")","v":{"$error":"#REF!"}},null,null,{"$f":"IF(#REF!<>\"\",#REF!+#REF!/1000,\"\")","v":{"$error":"#REF!"}}]
[null,null,null,null,null,null,null,null,null,null,null,"Other- Please type below",null,null,null,{"$f":"IF(#REF!<>\"\",#REF!+#REF!/1000,\"\")","v":{"$error":"#REF!"}},null,null,{"$f":"IF(#REF!<>\"\",#REF!+#REF!/1000,\"\")","v":{"$error":"#REF!"}}]
[null,null,null,null,null,null,null,null,null,null,null,null,null,null,null,{"$f":"IF(#REF!<>\"\",#REF!+#REF!/1000,\"\")","v":{"$error":"#REF!"}},null,null,{"$f":"IF(#REF!<>\"\",#REF!+#REF!/1000,\"\")","v":{"$error":"#REF!"}}]
[null,null,null,null,null,null,null,null,null,null,null,null,null,null,null,{"$f":"IF(#REF!<>\"\",#REF!+#REF!/1000,\"\")","v":{"$error":"#REF!"}},null,null,{"$f":"IF(#REF!<>\"\",#REF!+#REF!/1000,\"\")","v":{"$error":"#REF!"}}]
[null,null,null,null,null,null,null,null,null,null,null,null,null,null,null,{"$f":"IF(#REF!<>\"\",#REF!+#REF!/1000,\"\")","v":{"$error":"#REF!"}},null,null,{"$f":"IF(#REF!<>\"\",#REF!+#REF!/1000,\"\")","v":{"$error":"#REF!"}}]
[null,null,null,null,null,null,null,null,null,null,null,null,null,null,null,{"$f":"IF(#REF!<>\"\",#REF!+#REF!/1000,\"\")","v":{"$error":"#REF!"}},null,null,{"$f":"IF(#REF!<>\"\",#REF!+#REF!/1000,\"\")","v":{"$error":"#REF!"}}]
[null,null,null,null,null,null,null,null,null,null,null,null,null,null,null,{"$f":"IF(#REF!<>\"\",#REF!+#REF!/1000,\"\")","v":{"$error":"#REF!"}},null,null,{"$f":"IF(#REF!<>\"\",#REF!+#REF!/1000,\"\")","v":{"$error":"#REF!"}}]
[null,null,null,null,null,null,null,null,null,null,null,null,null,null,null,{"$f":"IF(#REF!<>\"\",#REF!+#REF!/1000,\"\")","v":{"$error":"#REF!"}},null,null,{"$f":"IF(#REF!<>\"\",#REF!+#REF!/1000,\"\")","v":{"$error":"#REF!"}}]
[null,null,null,null,null,null,null,null,null,null,null,null,null,null,null,{"$f":"IF(#REF!<>\"\",#REF!+#REF!/1000,\"\")","v":{"$error":"#REF!"}},null,null,{"$f":"IF(#REF!<>\"\",#REF!+#REF!/1000,\"\")","v":{"$error":"#REF!"}}]
[null,null,null,null,null,null,null,null,null,null,null,null,null,null,null,{"$f":"IF(#REF!<>\"\",#REF!+#REF!/1000,\"\")","v":{"$error":"#REF!"}},null,null,{"$f":"IF(#REF!<>\"\",#REF!+#REF!/1000,\"\")","v":{"$error":"#REF!"}}]
[null,null,null,null,null,null,null,null,null,null,null,null,null,null,null,{"$f":"IF(#REF!<>\"\",#REF!+#REF!/1000,\"\")","v":{"$error":"#REF!"}},null,null,{"$f":"IF(#REF!<>\"\",#REF!+#REF!/1000,\"\")","v":{"$error":"#REF!"}}]
[null,null,null,null,null,null,null,null,null,null,null,null,null,null,null,{"$f":"IF(#REF!<>\"\",#REF!+#REF!/1000,\"\")","v":{"$error":"#REF!"}},null,null,{"$f":"IF(#REF!<>\"\",#REF!+#REF!/1000,\"\")","v":{"$error":"#REF!"}}]
[null,null,null,null,null,null,null,null,null,null,null,null,null,null,null,{"$f":"IF(#REF!<>\"\",#REF!+#REF!/1000,\"\")","v":{"$error":"#REF!"}},null,null,{"$f":"IF(#REF!<>\"\",#REF!+#REF!/1000,\"\")","v":{"$error":"#REF!"}}]
[null,null,null,null,null,null,null,null,null,null,null,null,null,null,null,{"$f":"IF(#REF!<>\"\",#REF!+#REF!/1000,\"\")","v":{"$error":"#REF!"}},null,null,{"$f":"IF(#REF!<>\"\",#REF!+#REF!/1000,\"\")","v":{"$error":"#REF!"}}]
[null,null,null,null,null,null,null,null,null,null,null,null,null,null,null,{"$f":"IF(#REF!<>\"\",#REF!+#REF!/1000,\"\")","v":{"$error":"#REF!"}},null,null,{"$f":"IF(#REF!<>\"\",#REF!+#REF!/1000,\"\")","v":{"$error":"#REF!"}}]
[null,null,null,null,null,null,null,null,null,null,null,null,null,null,null,{"$f":"IF(#REF!<>\"\",#REF!+#REF!/1000,\"\")","v":{"$error":"#REF!"}},null,null,{"$f":"IF(#REF!<>\"\",#REF!+#REF!/1000,\"\")","v":{"$error":"#REF!"}}]
[null,null,null,null,null,null,null,null,null,null,null,null,null,null,null,{"$f":"IF(#REF!<>\"\",#REF!+#REF!/1000,\"\")","v":{"$error":"#REF!"}},null,null,{"$f":"IF(#REF!<>\"\",#REF!+#REF!/1000,\"\")","v":{"$error":"#REF!"}}]
[null,null,null,null,null,null,null,null,null,null,null,null,null,null,null,{"$f":"IF(#REF!<>\"\",#REF!+#REF!/1000,\"\")","v":{"$error":"#REF!"}},null,null,{"$f":"IF(#REF!<>\"\",#REF!+#REF!/1000,\"\")","v":{"$error":"#REF!"}}]
[null,null,null,null,null,null,null,null,null,null,null,null,null,null,null,{"$f":"IF(#REF!<>\"\",#REF!+#REF!/1000,\"\")","v":{"$error":"#REF!"}},null,null,{"$f":"IF(#REF!<>\"\",#REF!+#REF!/1000,\"\")","v":{"$error":"#REF!"}}]
[null,null,null,null,null,null,null,null,null,null,null,null,null,null,null,{"$f":"IF(#REF!<>\"\",#REF!+#REF!/1000,\"\")","v":{"$error":"#REF!"}},null,null,{"$f":"IF(#REF!<>\"\",#REF!+#REF!/1000,\"\")","v":{"$error":"#REF!"}}]
[null,null,null,null,null,null,null,null,null,null,null,null,null,null,null,{"$f":"IF(#REF!<>\"\",#REF!+#REF!/1000,\"\")","v":{"$error":"#REF!"}},null,null,{"$f":"IF(#REF!<>\"\",#REF!+#REF!/1000,\"\")","v":{"$error":"#REF!"}}]
[null,null,null,null,null,null,null,null,null,null,null,null,null,null,null,{"$f":"IF(#REF!<>\"\",#REF!+#REF!/1000,\"\")","v":{"$error":"#REF!"}},null,null,{"$f":"IF(#REF!<>\"\",#REF!+#REF!/1000,\"\")","v":{"$error":"#REF!"}}]
[null,null,null,null,null,null,null,null,null,null,null,null,null,null,null,{"$f":"IF(#REF!<>\"\",#REF!+#REF!/1000,\"\")","v":{"$error":"#REF!"}},null,null,{"$f":"IF(#REF!<>\"\",#REF!+#REF!/1000,\"\")","v":{"$error":"#REF!"}}]
[null,null,null,null,null,null,null,null,null,null,null,null,null,null,null,{"$f":"IF(#REF!<>\"\",#REF!+#REF!/1000,\"\")","v":{"$error":"#REF!"}},null,null,{"$f":"IF(#REF!<>\"\",#REF!+#REF!/1000,\"\")","v":{"$error":"#REF!"}}]
[null,null,null,null,null,null,null,null,null,null,null,null,null,null,null,{"$f":"IF(#REF!<>\"\",#REF!+#REF!/1000,\"\")","v":{"$error":"#REF!"}},null,null,{"$f":"IF(#REF!<>\"\",#REF!+#REF!/1000,\"\")","v":{"$error":"#REF!"}}]
[null,null,null,null,null,null,null,null,null,null,null,null,null,null,null,{"$f":"IF(#REF!<>\"\",#REF!+#REF!/1000,\"\")","v":{"$error":"#REF!"}},null,null,{"$f":"IF(#REF!<>\"\",#REF!+#REF!/1000,\"\")","v":{"$error":"#REF!"}}]
[null,null,null,null,null,null,null,null,null,null,null,null,null,null,null,{"$f":"IF(#REF!<>\"\",#REF!+#REF!/1000,\"\")","v":{"$error":"#REF!"}},null,null,{"$f":"IF(#REF!<>\"\",#REF!+#REF!/1000,\"\")","v":{"$error":"#REF!"}}]
[null,null,null,null,null,null,null,null,null,null,null,null,null,null,null,{"$f":"IF(#REF!<>\"\",#REF!+#REF!/1000,\"\")","v":{"$error":"#REF!"}},null,null,{"$f":"IF(#REF!<>\"\",#REF!+#REF!/1000,\"\")","v":{"$error":"#REF!"}}]
[null,null,null,null,null,null,null,null,null,null,null,null,null,null,null,{"$f":"IF(#REF!<>\"\",#REF!+#REF!/1000,\"\")","v":{"$error":"#REF!"}},null,null,{"$f":"IF(#REF!<>\"\",#REF!+#REF!/1000,\"\")","v":{"$error":"#REF!"}}]
[null,null,null,null,null,null,null,null,null,null,null,null,null,null,null,{"$f":"IF(#REF!<>\"\",#REF!+#REF!/1000,\"\")","v":{"$error":"#REF!"}},null,null,{"$f":"IF(#REF!<>\"\",#REF!+#REF!/1000,\"\")","v":{"$error":"#REF!"}}]
[null,null,null,null,null,null,null,null,null,null,null,null,null,null,null,{"$f":"IF(#REF!<>\"\",#REF!+#REF!/1000,\"\")","v":{"$error":"#REF!"}},null,null,{"$f":"IF(#REF!<>\"\",#REF!+#REF!/1000,\"\")","v":{"$error":"#REF!"}}]
[null,null,null,null,null,null,null,null,null,null,null,null,null,null,null,{"$f":"IF(#REF!<>\"\",#REF!+#REF!/1000,\"\")","v":{"$error":"#REF!"}},null,null,{"$f":"IF(#REF!<>\"\",#REF!+#REF!/1000,\"\")","v":{"$error":"#REF!"}}]
[null,null,null,null,null,null,null,null,null,null,null,null,null,null,null,{"$f":"IF(#REF!<>\"\",#REF!+#REF!/1000,\"\")","v":{"$error":"#REF!"}},null,null,{"$f":"IF(#REF!<>\"\",#REF!+#REF!/1000,\"\")","v":{"$error":"#REF!"}}]
[null,null,null,null,null,null,null,null,null,null,null,null,null,null,null,{"$f":"IF(#REF!<>\"\",#REF!+#REF!/1000,\"\")","v":{"$error":"#REF!"}},null,null,{"$f":"IF(#REF!<>\"\",#REF!+#REF!/1000,\"\")","v":{"$error":"#REF!"}}]
[null,null,null,null,null,null,null,null,null,null,null,null,null,null,null,{"$f":"IF(#REF!<>\"\",#REF!+#REF!/1000,\"\")","v":{"$error":"#REF!"}}]
[]
[null,null,null,null,null,null,null,null,null,null,null,null,null,null,null,{"$f":"IF(#REF!<>\"\",#REF!+#REF!/1000,\"\")","v":{"$error":"#REF!"}}]
[null,null,null,null,null,null,null,null,null,null,null,null,null,null,null,{"$f":"IF(#REF!<>\"\",#REF!+#REF!/1000,\"\")","v":{"$error":"#REF!"}}]

{"sheet":"Sheet5","index":5,"n_rows":0,"n_cols":0,"rows_kept":0,"cut":false,"hidden":true,"merged":[]}

{"sheet":"Irrig Summary","index":6,"n_rows":31,"n_cols":8,"rows_kept":31,"cut":false,"hidden":false,"merged":[[11,7,11,8],[17,4,17,5],[24,1,24,2],[23,4,24,8],[17,1,17,2]]}
[]
[]
[]
[]
[]
["Irrigation Summary"]
[]
[]
[]
[null,"Evaluator: ",{"$f":"IF('Irrigation System Information '!F7=\"\",\"\",'Irrigation System Information '!F7)","v":"Auditor XYZ"},null,null,null,"Location: ",{"$f":"IF('ETo, Soil, C.C., Irr Info.'!C5=\"\",\"\",'ETo, Soil, C.C., Irr Info.'!C5)","v":"Davis"}]
[null,"Date: ",{"$f":"IF('Irrigation System Information '!B8=\"\",\"\",'Irrigation System Information '!B8)","v":"19/25/2014"},null,null,null,"ETo Zone: ",{"$f":"ETo_Zone","v":14}]
[null,"Controller: ",{"$f":"IF('Irrigation System Information '!B11=\"\",\"\",'Irrigation System Information '!B11)","v":"WaterManager X2"},null,null,null,"Soil type: ",{"$f":"Soil_Texture","v":"sandy loam"}]
[null,"Zone name: ",{"$f":"IF('Irrigation System Information '!B7=\"\",\"\",'Irrigation System Information '!B7)","v":"Test zone 12"},null,null,null,"Depth to wet: ",{"$f":"CONCATENATE(Depth_To_Wet,\" in.\")","v":"12 in."}]
[null,"Station: ",{"$f":"IF('Irrigation System Information '!F11=\"\",\"\",'Irrigation System Information '!F11)","v":"Turf west"}]
[]
[]
[null,null,"DULQ  ",{"$f":"AveLQ/AveT","v":0.65454545454545454}," AvgLQ/AvgT"]
[null,"PR (in/hr) ",null,{"$f":"'DU CALCS \"mL.\"'!C51","v":1.0105421686746989}," Avg precip rate"]
[null,null,"Scheduling multiplier ",{"$f":"1/(0.4+(0.6*DU))","v":1.261467889908257}," =1/(0.4+(0.6*DU))"]
[null,null,{"$f":"CONCATENATE(\"Inches to wet \",Depth_To_Wet,\" in depth (in) \")","v":"Inches to wet 12 in depth (in) "},{"$f":"INDEX(Soil_Table,MATCH(Soil_Texture,'SOIL INFORMATION'!B6:B17, FALSE),3)","v":0.66}]
[null,null,{"$f":"CONCATENATE(\"Time to wet \",Depth_To_Wet,\" in depth (min) \")","v":"Time to wet 12 in depth (min) "},{"$f":"INT(INDEX(Soil_Table,MATCH(Soil_Texture,'SOIL INFORMATION'!B6:B17, FALSE),3)/D18*60)","v":39}," \"Lower boundary\""]
[null,null,"Max duration (min) ",{"$f":"INT(Time_to_wet_d*SM)","v":49}," \"Upper boundary\""]
[]
[null,null,"Run Time per Cycle (min) ",{"$f":"IF(Time_to_Runoff<>\"\",IF(Time_to_Runoff>0,VLOOKUP(1,'DU CALCS \"mL.\"'!J9:K23,2,FALSE),Max_Duration),Max_Duration)","v":12},{"$f":"CONCATENATE(\"This is the duration and fewest cycles that provide at least \",'DU CALCS \"mL.\"'!L6*100,\"% of the Upper Boundary.\")","v":"This is the duration and fewest cycles that provide at least 90% of the Upper Boundary."}]
[null,"Number of cycles ",null,{"$f":"INT(Max_Duration/D24)","v":4}]
[null,null,"Relative amount applied (%) ",{"$f":"(D24*D25)/Max_Duration","v":0.97959183673469385}]
[null,null,"Amount applied (in) ",{"$f":"in_to_wet_d*D26","v":0.64653061224489794}]
[]
[null,null,"Infiltration Rate (in/hr) ",{"$f":"INDEX(Soil_Table,MATCH(Soil_Texture,'SOIL INFORMATION'!B6:B17, FALSE),1)","v":0.8}]
[]
[null,null,null,{"$f":"IF(Infiltration_rate/PRnet*60<Runtime,\"*Note that there is a potential for runoff\",\"\")","v":""}]

{"sheet":"Irrig Calendar","index":7,"n_rows":45,"n_cols":28,"rows_kept":45,"cut":false,"hidden":false,"merged":[[31,21,31,27],[1,21,1,27],[31,0,31,6],[31,7,31,13],[16,21,16,27],[1,0,1,6],[16,0,16,6],[31,14,31,20],[1,7,1,13],[16,7,16,13],[16,14,16,20],[1,14,1,20]]}
[null,null,{"$f":"CONCATENATE(\"Irrigation schedule for  zone: \",'Irrigation System Information '!B7,\".\")","v":"Irrigation schedule for  zone: Test zone 12."},null,null,null,null,null,null,{"$f":"CONCATENATE(\"Irrigation schedule for  zone: \",'Irrigation System Information '!B7,\".\")","v":"Irrigation schedule for  zone: Test zone 12."},null,null,null,null,null,null,{"$f":"CONCATENATE(\"Irrigation schedule for  zone: \",'Irrigation System Information '!B7,\".\")","v":"Irrigation schedule for  zone: Test zone 12."},null,null,null,null,null,null,{"$f":"CONCATENATE(\"Irrigation schedule for  zone: \",'Irrigation System Information '!B7,\".\")","v":"Irrigation schedule for  zone: Test zone 12."}]
[{"$f":"CONCATENATE(\"January \",Irrig_Year)","v":"January 2017"},null,null,null,null,null,null,{"$f":"CONCATENATE(\"April \",Irrig_Year)","v":"April 2017"},null,null,null,null,null,null,{"$f":"CONCATENATE(\"July \",Irrig_Year)","v":"July 2017"},null,null,null,null,null,null,{"$f":"CONCATENATE(\"October \",Irrig_Year)","v":"October 2017"}]
["SUNDAY","MONDAY","TUESDAY","WEDNESDAY","THURSDAY","FRIDAY","SATURDAY","SUNDAY","MONDAY","TUESDAY","WEDNESDAY","THURSDAY","FRIDAY","SATURDAY","SUNDAY","MONDAY","TUESDAY","WEDNESDAY","THURSDAY","FRIDAY","SATURDAY","SUNDAY","MONDAY","TUESDAY","WEDNESDAY","THURSDAY","FRIDAY","SATURDAY"]
[{"$f":"IF(AND(YEAR(JanOffset+1)=CalendarYear,MONTH(JanOffset+1)=1),DAY(JanOffset+1),\"\")","v":"1900-01-01"},{"$f":"IF(AND(YEAR(JanOffset+21)=CalendarYear,MONTH(JanOffset+2)=1),DAY(JanOffset+2),\"\")","v":"1900-01-02"},{"$f":"IF(AND(YEAR(JanOffset+3)=CalendarYear,MONTH(JanOffset+3)=1),DAY(JanOffset+3),\"\")","v":"1900-01-03"},{"$f":"IF(AND(YEAR(JanOffset+4)=CalendarYear,MONTH(JanOffset+4)=1),DAY(JanOffset+4),\"\")","v":"1900-01-04"},{"$f":"IF(AND(YEAR(JanOffset+5)=CalendarYear,MONTH(JanOffset+5)=1),DAY(JanOffset+5),\"\")","v":"1900-01-05"},{"$f":"IF(AND(YEAR(JanOffset+6)=CalendarYear,MONTH(JanOffset+6)=1),DAY(JanOffset+6),\"\")","v":"1900-01-06"},{"$f":"IF(AND(YEAR(JanOffset+7)=CalendarYear,MONTH(JanOffset+7)=1),DAY(JanOffset+7),\"\")","v":"1900-01-07"},{"$f":"IF(AND(YEAR(AprOffset+1)=CalendarYear,MONTH(AprOffset+1)=4),DAY(AprOffset+1),\"\")","v":""},{"$f":"IF(AND(YEAR(AprOffset+2)=CalendarYear,MONTH(AprOffset+2)=4),DAY(AprOffset+2),\"\")","v":""},{"$f":"IF(AND(YEAR(AprOffset+3)=CalendarYear,MONTH(AprOffset+3)=4),DAY(AprOffset+3),\"\")","v":""},{"$f":"IF(AND(YEAR(AprOffset+4)=CalendarYear,MONTH(AprOffset+4)=4),DAY(AprOffset+4),\"\")","v":""},{"$f":"IF(AND(YEAR(AprOffset+5)=CalendarYear,MONTH(AprOffset+5)=4),DAY(AprOffset+5),\"\")","v":""},{"$f":"IF(AND(YEAR(AprOffset+6)=CalendarYear,MONTH(AprOffset+6)=4),DAY(AprOffset+6),\"\")","v":""},{"$f":"IF(AND(YEAR(AprOffset+7)=CalendarYear,MONTH(AprOffset+7)=4),DAY(AprOffset+7),\"\")","v":"1900-01-01"},{"$f":"IF(AND(YEAR(JulOffset+1)=CalendarYear,MONTH(JulOffset+1)=7),DAY(JulOffset+1),\"\")","v":""},{"$f":"IF(AND(YEAR(JulOffset+2)=CalendarYear,MONTH(JulOffset+2)=7),DAY(JulOffset+2),\"\")","v":""},{"$f":"IF(AND(YEAR(JulOffset+3)=CalendarYear,MONTH(JulOffset+3)=7),DAY(JulOffset+3),\"\")","v":""},{"$f":"IF(AND(YEAR(JulOffset+4)=CalendarYear,MONTH(JulOffset+4)=7),DAY(JulOffset+4),\"\")","v":""},{"$f":"IF(AND(YEAR(JulOffset+5)=CalendarYear,MONTH(JulOffset+5)=7),DAY(JulOffset+5),\"\")","v":""},{"$f":"IF(AND(YEAR(JulOffset+6)=CalendarYear,MONTH(JulOffset+6)=7),DAY(JulOffset+6),\"\")","v":""},{"$f":"IF(AND(YEAR(JulOffset+7)=CalendarYear,MONTH(JulOffset+7)=7),DAY(JulOffset+7),\"\")","v":"1900-01-01"},{"$f":"IF(AND(YEAR(OctOffset+1)=CalendarYear,MONTH(OctOffset+1)=10),DAY(OctOffset+1),\"\")","v":"1900-01-01"},{"$f":"IF(AND(YEAR(OctOffset+2)=CalendarYear,MONTH(OctOffset+2)=10),DAY(OctOffset+2),\"\")","v":"1900-01-02"},{"$f":"IF(AND(YEAR(OctOffset+3)=CalendarYear,MONTH(OctOffset+3)=10),DAY(OctOffset+3),\"\")","v":"1900-01-03"},{"$f":"IF(AND(YEAR(OctOffset+4)=CalendarYear,MONTH(OctOffset+4)=10),DAY(OctOffset+4),\"\")","v":"1900-01-04"},{"$f":"IF(AND(YEAR(OctOffset+5)=CalendarYear,MONTH(OctOffset+5)=10),DAY(OctOffset+5),\"\")","v":"1900-01-05"},{"$f":"IF(AND(YEAR(OctOffset+6)=CalendarYear,MONTH(OctOffset+6)=10),DAY(OctOffset+6),\"\")","v":"1900-01-06"},{"$f":"IF(AND(YEAR(OctOffset+7)=CalendarYear,MONTH(OctOffset+7)=10),DAY(OctOffset+7),\"\")","v":"1900-01-07"}]
[{"$f":"IF(A4=\"\",\"\",INDEX('Irrig Sched'!$E$9:$E$39,MATCH(A4,'Irrig Sched'!$B$9:$B$39,0)))","v":""},{"$f":"IF(B4=\"\",\"\",INDEX('Irrig Sched'!$E$9:$E$39,MATCH(B4,'Irrig Sched'!$B$9:$B$39,0)))","v":""},{"$f":"IF(C4=\"\",\"\",INDEX('Irrig Sched'!$E$9:$E$39,MATCH(C4,'Irrig Sched'!$B$9:$B$39,0)))","v":""},{"$f":"IF(D4=\"\",\"\",INDEX('Irrig Sched'!$E$9:$E$39,MATCH(D4,'Irrig Sched'!$B$9:$B$39,0)))","v":""},{"$f":"IF(E4=\"\",\"\",INDEX('Irrig Sched'!$E$9:$E$39,MATCH(E4,'Irrig Sched'!$B$9:$B$39,0)))","v":""},{"$f":"IF(F4=\"\",\"\",INDEX('Irrig Sched'!$E$9:$E$39,MATCH(F4,'Irrig Sched'!$B$9:$B$39,0)))","v":""},{"$f":"IF(G4=\"\",\"\",INDEX('Irrig Sched'!$E$9:$E$39,MATCH(G4,'Irrig Sched'!$B$9:$B$39,0)))","v":""},{"$f":"IF(H4=\"\",\"\",INDEX('Irrig Sched'!$T$9:$T$39,MATCH(H4,'Irrig Sched'!$Q$9:$Q$39,0)))","v":""},{"$f":"IF(I4=\"\",\"\",INDEX('Irrig Sched'!$T$9:$T$39,MATCH(I4,'Irrig Sched'!$Q$9:$Q$39,0)))","v":""},{"$f":"IF(J4=\"\",\"\",INDEX('Irrig Sched'!$T$9:$T$39,MATCH(J4,'Irrig Sched'!$Q$9:$Q$39,0)))","v":""},{"$f":"IF(K4=\"\",\"\",INDEX('Irrig Sched'!$T$9:$T$39,MATCH(K4,'Irrig Sched'!$Q$9:$Q$39,0)))","v":""},{"$f":"IF(L4=\"\",\"\",INDEX('Irrig Sched'!$T$9:$T$39,MATCH(L4,'Irrig Sched'!$Q$9:$Q$39,0)))","v":""},{"$f":"IF(M4=\"\",\"\",INDEX('Irrig Sched'!$T$9:$T$39,MATCH(M4,'Irrig Sched'!$Q$9:$Q$39,0)))","v":""},{"$f":"IF(N4=\"\",\"\",INDEX('Irrig Sched'!$T$9:$T$39,MATCH(N4,'Irrig Sched'!$Q$9:$Q$39,0)))","v":"Run"},{"$f":"IF(O4=\"\",\"\",INDEX('Irrig Sched'!$AI$9:$AI$39,MATCH(O4,'Irrig Sched'!$AF$9:$AF$39,0)))","v":""},{"$f":"IF(P4=\"\",\"\",INDEX('Irrig Sched'!$AI$9:$AI$39,MATCH(P4,'Irrig Sched'!$AF$9:$AF$39,0)))","v":""},{"$f":"IF(Q4=\"\",\"\",INDEX('Irrig Sched'!$AI$9:$AI$39,MATCH(Q4,'Irrig Sched'!$AF$9:$AF$39,0)))","v":""},{"$f":"IF(R4=\"\",\"\",INDEX('Irrig Sched'!$AI$9:$AI$39,MATCH(R4,'Irrig Sched'!$AF$9:$AF$39,0)))","v":""},{"$f":"IF(S4=\"\",\"\",INDEX('Irrig Sched'!$AI$9:$AI$39,MATCH(S4,'Irrig Sched'!$AF$9:$AF$39,0)))","v":""},{"$f":"IF(T4=\"\",\"\",INDEX('Irrig Sched'!$AI$9:$AI$39,MATCH(T4,'Irrig Sched'!$AF$9:$AF$39,0)))","v":""},{"$f":"IF(U4=\"\",\"\",INDEX('Irrig Sched'!$AI$9:$AI$39,MATCH(U4,'Irrig Sched'!$AF$9:$AF$39,0)))","v":""},{"$f":"IF(V4=\"\",\"\",INDEX('Irrig Sched'!$AX$9:$AX$39,MATCH(V4,'Irrig Sched'!$AU$9:$AU$39,0)))","v":""},{"$f":"IF(W4=\"\",\"\",INDEX('Irrig Sched'!$AX$9:$AX$39,MATCH(W4,'Irrig Sched'!$AU$9:$AU$39,0)))","v":""},{"$f":"IF(X4=\"\",\"\",INDEX('Irrig Sched'!$AX$9:$AX$39,MATCH(X4,'Irrig Sched'!$AU$9:$AU$39,0)))","v":"Run"},{"$f":"IF(Y4=\"\",\"\",INDEX('Irrig Sched'!$AX$9:$AX$39,MATCH(Y4,'Irrig Sched'!$AU$9:$AU$39,0)))","v":""},{"$f":"IF(Z4=\"\",\"\",INDEX('Irrig Sched'!$AX$9:$AX$39,MATCH(Z4,'Irrig Sched'!$AU$9:$AU$39,0)))","v":""},{"$f":"IF(AA4=\"\",\"\",INDEX('Irrig Sched'!$AX$9:$AX$39,MATCH(AA4,'Irrig Sched'!$AU$9:$AU$39,0)))","v":""},{"$f":"IF(AB4=\"\",\"\",INDEX('Irrig Sched'!$AX$9:$AX$39,MATCH(AB4,'Irrig Sched'!$AU$9:$AU$39,0)))","v":""}]
[{"$f":"IF(AND(YEAR(JanOffset+8)=CalendarYear,MONTH(JanOffset+8)=1),DAY(JanOffset+8),\"\")","v":"1900-01-08"},{"$f":"IF(AND(YEAR(JanOffset+9)=CalendarYear,MONTH(JanOffset+9)=1),DAY(JanOffset+9),\"\")","v":"1900-01-09"},{"$f":"IF(AND(YEAR(JanOffset+10)=CalendarYear,MONTH(JanOffset+10)=1),DAY(JanOffset+10),\"\")","v":"1900-01-10"},{"$f":"IF(AND(YEAR(JanOffset+11)=CalendarYear,MONTH(JanOffset+11)=1),DAY(JanOffset+11),\"\")","v":"1900-01-11"},{"$f":"IF(AND(YEAR(JanOffset+12)=CalendarYear,MONTH(JanOffset+12)=1),DAY(JanOffset+12),\"\")","v":"1900-01-12"},{"$f":"IF(AND(YEAR(JanOffset+13)=CalendarYear,MONTH(JanOffset+13)=1),DAY(JanOffset+13),\"\")","v":"1900-01-13"},{"$f":"IF(AND(YEAR(JanOffset+14)=CalendarYear,MONTH(JanOffset+14)=1),DAY(JanOffset+14),\"\")","v":"1900-01-14"},{"$f":"IF(AND(YEAR(AprOffset+8)=CalendarYear,MONTH(AprOffset+8)=4),DAY(AprOffset+8),\"\")","v":"1900-01-02"},{"$f":"IF(AND(YEAR(AprOffset+9)=CalendarYear,MONTH(AprOffset+9)=4),DAY(AprOffset+9),\"\")","v":"1900-01-03"},{"$f":"IF(AND(YEAR(AprOffset+10)=CalendarYear,MONTH(AprOffset+10)=4),DAY(AprOffset+10),\"\")","v":"1900-01-04"},{"$f":"IF(AND(YEAR(AprOffset+11)=CalendarYear,MONTH(AprOffset+11)=4),DAY(AprOffset+11),\"\")","v":"1900-01-05"},{"$f":"IF(AND(YEAR(AprOffset+12)=CalendarYear,MONTH(AprOffset+12)=4),DAY(AprOffset+12),\"\")","v":"1900-01-06"},{"$f":"IF(AND(YEAR(AprOffset+13)=CalendarYear,MONTH(AprOffset+13)=4),DAY(AprOffset+13),\"\")","v":"1900-01-07"},{"$f":"IF(AND(YEAR(AprOffset+14)=CalendarYear,MONTH(AprOffset+14)=4),DAY(AprOffset+14),\"\")","v":"1900-01-08"},{"$f":"IF(AND(YEAR(JulOffset+8)=CalendarYear,MONTH(JulOffset+8)=7),DAY(JulOffset+8),\"\")","v":"1900-01-02"},{"$f":"IF(AND(YEAR(JulOffset+9)=CalendarYear,MONTH(JulOffset+9)=7),DAY(JulOffset+9),\"\")","v":"1900-01-03"},{"$f":"IF(AND(YEAR(JulOffset+10)=CalendarYear,MONTH(JulOffset+10)=7),DAY(JulOffset+10),\"\")","v":"1900-01-04"},{"$f":"IF(AND(YEAR(JulOffset+11)=CalendarYear,MONTH(JulOffset+11)=7),DAY(JulOffset+11),\"\")","v":"1900-01-05"},{"$f":"IF(AND(YEAR(JulOffset+12)=CalendarYear,MONTH(JulOffset+12)=7),DAY(JulOffset+12),\"\")","v":"1900-01-06"},{"$f":"IF(AND(YEAR(JulOffset+13)=CalendarYear,MONTH(JulOffset+13)=7),DAY(JulOffset+13),\"\")","v":"1900-01-07"},{"$f":"IF(AND(YEAR(JulOffset+14)=CalendarYear,MONTH(JulOffset+14)=7),DAY(JulOffset+14),\"\")","v":"1900-01-08"},{"$f":"IF(AND(YEAR(OctOffset+8)=CalendarYear,MONTH(OctOffset+8)=10),DAY(OctOffset+8),\"\")","v":"1900-01-08"},{"$f":"IF(AND(YEAR(OctOffset+9)=CalendarYear,MONTH(OctOffset+9)=10),DAY(OctOffset+9),\"\")","v":"1900-01-09"},{"$f":"IF(AND(YEAR(OctOffset+10)=CalendarYear,MONTH(OctOffset+10)=10),DAY(OctOffset+10),\"\")","v":"1900-01-10"},{"$f":"IF(AND(YEAR(OctOffset+11)=CalendarYear,MONTH(OctOffset+11)=10),DAY(OctOffset+11),\"\")","v":"1900-01-11"},{"$f":"IF(AND(YEAR(OctOffset+12)=CalendarYear,MONTH(OctOffset+12)=10),DAY(OctOffset+12),\"\")","v":"1900-01-12"},{"$f":"IF(AND(YEAR(OctOffset+13)=CalendarYear,MONTH(OctOffset+13)=10),DAY(OctOffset+13),\"\")","v":"1900-01-13"},{"$f":"IF(AND(YEAR(OctOffset+14)=CalendarYear,MONTH(OctOffset+14)=10),DAY(OctOffset+14),\"\")","v":"1900-01-14"}]
[{"$f":"INDEX('Irrig Sched'!$E$9:$E$39,MATCH(A6,'Irrig Sched'!$B$9:$B$39,0))","v":""},{"$f":"INDEX('Irrig Sched'!$E$9:$E$39,MATCH(B6,'Irrig Sched'!$B$9:$B$39,0))","v":""},{"$f":"INDEX('Irrig Sched'!$E$9:$E$39,MATCH(C6,'Irrig Sched'!$B$9:$B$39,0))","v":""},{"$f":"INDEX('Irrig Sched'!$E$9:$E$39,MATCH(D6,'Irrig Sched'!$B$9:$B$39,0))","v":""},{"$f":"INDEX('Irrig Sched'!$E$9:$E$39,MATCH(E6,'Irrig Sched'!$B$9:$B$39,0))","v":""},{"$f":"INDEX('Irrig Sched'!$E$9:$E$39,MATCH(F6,'Irrig Sched'!$B$9:$B$39,0))","v":""},{"$f":"INDEX('Irrig Sched'!$E$9:$E$39,MATCH(G6,'Irrig Sched'!$B$9:$B$39,0))","v":""},{"$f":"INDEX('Irrig Sched'!$T$9:$T$39,MATCH(H6,'Irrig Sched'!$Q$9:$Q$39,0))","v":""},{"$f":"INDEX('Irrig Sched'!$T$9:$T$39,MATCH(I6,'Irrig Sched'!$Q$9:$Q$39,0))","v":""},{"$f":"INDEX('Irrig Sched'!$T$9:$T$39,MATCH(J6,'Irrig Sched'!$Q$9:$Q$39,0))","v":""},{"$f":"INDEX('Irrig Sched'!$T$9:$T$39,MATCH(K6,'Irrig Sched'!$Q$9:$Q$39,0))","v":""},{"$f":"INDEX('Irrig Sched'!$T$9:$T$39,MATCH(L6,'Irrig Sched'!$Q$9:$Q$39,0))","v":""},{"$f":"INDEX('Irrig Sched'!$T$9:$T$39,MATCH(M6,'Irrig Sched'!$Q$9:$Q$39,0))","v":""},{"$f":"INDEX('Irrig Sched'!$T$9:$T$39,MATCH(N6,'Irrig Sched'!$Q$9:$Q$39,0))","v":"Run"},{"$f":"INDEX('Irrig Sched'!$AI$9:$AI$39,MATCH(O6,'Irrig Sched'!$AF$9:$AF$39,0))","v":""},{"$f":"INDEX('Irrig Sched'!$AI$9:$AI$39,MATCH(P6,'Irrig Sched'!$AF$9:$AF$39,0))","v":""},{"$f":"INDEX('Irrig Sched'!$AI$9:$AI$39,MATCH(Q6,'Irrig Sched'!$AF$9:$AF$39,0))","v":"Run"},{"$f":"INDEX('Irrig Sched'!$AI$9:$AI$39,MATCH(R6,'Irrig Sched'!$AF$9:$AF$39,0))","v":""},{"$f":"INDEX('Irrig Sched'!$AI$9:$AI$39,MATCH(S6,'Irrig Sched'!$AF$9:$AF$39,0))","v":""},{"$f":"INDEX('Irrig Sched'!$AI$9:$AI$39,MATCH(T6,'Irrig Sched'!$AF$9:$AF$39,0))","v":""},{"$f":"INDEX('Irrig Sched'!$AI$9:$AI$39,MATCH(U6,'Irrig Sched'!$AF$9:$AF$39,0))","v":"Run"},{"$f":"INDEX('Irrig Sched'!$AX$9:$AX$39,MATCH(V6,'Irrig Sched'!$AU$9:$AU$39,0))","v":""},{"$f":"INDEX('Irrig Sched'!$AX$9:$AX$39,MATCH(W6,'Irrig Sched'!$AU$9:$AU$39,0))","v":""},{"$f":"INDEX('Irrig Sched'!$AX$9:$AX$39,MATCH(X6,'Irrig Sched'!$AU$9:$AU$39,0))","v":"Run"},{"$f":"INDEX('Irrig Sched'!$AX$9:$AX$39,MATCH(Y6,'Irrig Sched'!$AU$9:$AU$39,0))","v":""},{"$f":"INDEX('Irrig Sched'!$AX$9:$AX$39,MATCH(Z6,'Irrig Sched'!$AU$9:$AU$39,0))","v":""},{"$f":"INDEX('Irrig Sched'!$AX$9:$AX$39,MATCH(AA6,'Irrig Sched'!$AU$9:$AU$39,0))","v":""},{"$f":"INDEX('Irrig Sched'!$AX$9:$AX$39,MATCH(AB6,'Irrig Sched'!$AU$9:$AU$39,0))","v":""}]
[{"$f":"IF(AND(YEAR(JanOffset+15)=CalendarYear,MONTH(JanOffset+15)=1),DAY(JanOffset+15),\"\")","v":"1900-01-15"},{"$f":"IF(AND(YEAR(JanOffset+16)=CalendarYear,MONTH(JanOffset+16)=1),DAY(JanOffset+16),\"\")","v":"1900-01-16"},{"$f":"IF(AND(YEAR(JanOffset+17)=CalendarYear,MONTH(JanOffset+17)=1),DAY(JanOffset+17),\"\")","v":"1900-01-17"},{"$f":"IF(AND(YEAR(JanOffset+18)=CalendarYear,MONTH(JanOffset+18)=1),DAY(JanOffset+18),\"\")","v":"1900-01-18"},{"$f":"IF(AND(YEAR(JanOffset+19)=CalendarYear,MONTH(JanOffset+19)=1),DAY(JanOffset+19),\"\")","v":"1900-01-19"},{"$f":"IF(AND(YEAR(JanOffset+20)=CalendarYear,MONTH(JanOffset+20)=1),DAY(JanOffset+20),\"\")","v":"1900-01-20"},{"$f":"IF(AND(YEAR(JanOffset+21)=CalendarYear,MONTH(JanOffset+21)=1),DAY(JanOffset+21),\"\")","v":"1900-01-21"},{"$f":"IF(AND(YEAR(AprOffset+15)=CalendarYear,MONTH(AprOffset+15)=4),DAY(AprOffset+15),\"\")","v":"1900-01-09"},{"$f":"IF(AND(YEAR(AprOffset+16)=CalendarYear,MONTH(AprOffset+16)=4),DAY(AprOffset+16),\"\")","v":"1900-01-10"},{"$f":"IF(AND(YEAR(AprOffset+17)=CalendarYear,MONTH(AprOffset+17)=4),DAY(AprOffset+17),\"\")","v":"1900-01-11"},{"$f":"IF(AND(YEAR(AprOffset+18)=CalendarYear,MONTH(AprOffset+18)=4),DAY(AprOffset+18),\"\")","v":"1900-01-12"},{"$f":"IF(AND(YEAR(AprOffset+19)=CalendarYear,MONTH(AprOffset+19)=4),DAY(AprOffset+19),\"\")","v":"1900-01-13"},{"$f":"IF(AND(YEAR(AprOffset+20)=CalendarYear,MONTH(AprOffset+20)=4),DAY(AprOffset+20),\"\")","v":"1900-01-14"},{"$f":"IF(AND(YEAR(AprOffset+21)=CalendarYear,MONTH(AprOffset+21)=4),DAY(AprOffset+21),\"\")","v":"1900-01-15"},{"$f":"IF(AND(YEAR(JulOffset+15)=CalendarYear,MONTH(JulOffset+15)=7),DAY(JulOffset+15),\"\")","v":"1900-01-09"},{"$f":"IF(AND(YEAR(JulOffset+16)=CalendarYear,MONTH(JulOffset+16)=7),DAY(JulOffset+16),\"\")","v":"1900-01-10"},{"$f":"IF(AND(YEAR(JulOffset+17)=CalendarYear,MONTH(JulOffset+17)=7),DAY(JulOffset+17),\"\")","v":"1900-01-11"},{"$f":"IF(AND(YEAR(JulOffset+18)=CalendarYear,MONTH(JulOffset+18)=7),DAY(JulOffset+18),\"\")","v":"1900-01-12"},{"$f":"IF(AND(YEAR(JulOffset+19)=CalendarYear,MONTH(JulOffset+19)=7),DAY(JulOffset+19),\"\")","v":"1900-01-13"},{"$f":"IF(AND(YEAR(JulOffset+20)=CalendarYear,MONTH(JulOffset+20)=7),DAY(JulOffset+20),\"\")","v":"1900-01-14"},{"$f":"IF(AND(YEAR(JulOffset+21)=CalendarYear,MONTH(JulOffset+21)=7),DAY(JulOffset+21),\"\")","v":"1900-01-15"},{"$f":"IF(AND(YEAR(OctOffset+15)=CalendarYear,MONTH(OctOffset+15)=10),DAY(OctOffset+15),\"\")","v":"1900-01-15"},{"$f":"IF(AND(YEAR(OctOffset+16)=CalendarYear,MONTH(OctOffset+16)=10),DAY(OctOffset+16),\"\")","v":"1900-01-16"},{"$f":"IF(AND(YEAR(OctOffset+17)=CalendarYear,MONTH(OctOffset+17)=10),DAY(OctOffset+17),\"\")","v":"1900-01-17"},{"$f":"IF(AND(YEAR(OctOffset+18)=CalendarYear,MONTH(OctOffset+18)=10),DAY(OctOffset+18),\"\")","v":"1900-01-18"},{"$f":"IF(AND(YEAR(OctOffset+19)=CalendarYear,MONTH(OctOffset+19)=10),DAY(OctOffset+19),\"\")","v":"1900-01-19"},{"$f":"IF(AND(YEAR(OctOffset+20)=CalendarYear,MONTH(OctOffset+20)=10),DAY(OctOffset+20),\"\")","v":"1900-01-20"},{"$f":"IF(AND(YEAR(OctOffset+21)=CalendarYear,MONTH(OctOffset+21)=10),DAY(OctOffset+21),\"\")","v":"1900-01-21"}]
[{"$f":"INDEX('Irrig Sched'!$E$9:$E$39,MATCH(A8,'Irrig Sched'!$B$9:$B$39,0))","v":""},{"$f":"INDEX('Irrig Sched'!$E$9:$E$39,MATCH(B8,'Irrig Sched'!$B$9:$B$39,0))","v":""},{"$f":"INDEX('Irrig Sched'!$E$9:$E$39,MATCH(C8,'Irrig Sched'!$B$9:$B$39,0))","v":""},{"$f":"INDEX('Irrig Sched'!$E$9:$E$39,MATCH(D8,'Irrig Sched'!$B$9:$B$39,0))","v":""},{"$f":"INDEX('Irrig Sched'!$E$9:$E$39,MATCH(E8,'Irrig Sched'!$B$9:$B$39,0))","v":""},{"$f":"INDEX('Irrig Sched'!$E$9:$E$39,MATCH(F8,'Irrig Sched'!$B$9:$B$39,0))","v":""},{"$f":"INDEX('Irrig Sched'!$E$9:$E$39,MATCH(G8,'Irrig Sched'!$B$9:$B$39,0))","v":""},{"$f":"INDEX('Irrig Sched'!$T$9:$T$39,MATCH(H8,'Irrig Sched'!$Q$9:$Q$39,0))","v":""},{"$f":"INDEX('Irrig Sched'!$T$9:$T$39,MATCH(I8,'Irrig Sched'!$Q$9:$Q$39,0))","v":""},{"$f":"INDEX('Irrig Sched'!$T$9:$T$39,MATCH(J8,'Irrig Sched'!$Q$9:$Q$39,0))","v":""},{"$f":"INDEX('Irrig Sched'!$T$9:$T$39,MATCH(K8,'Irrig Sched'!$Q$9:$Q$39,0))","v":""},{"$f":"INDEX('Irrig Sched'!$T$9:$T$39,MATCH(L8,'Irrig Sched'!$Q$9:$Q$39,0))","v":"Run"},{"$f":"INDEX('Irrig Sched'!$T$9:$T$39,MATCH(M8,'Irrig Sched'!$Q$9:$Q$39,0))","v":""},{"$f":"INDEX('Irrig Sched'!$T$9:$T$39,MATCH(N8,'Irrig Sched'!$Q$9:$Q$39,0))","v":""},{"$f":"INDEX('Irrig Sched'!$AI$9:$AI$39,MATCH(O8,'Irrig Sched'!$AF$9:$AF$39,0))","v":""},{"$f":"INDEX('Irrig Sched'!$AI$9:$AI$39,MATCH(P8,'Irrig Sched'!$AF$9:$AF$39,0))","v":""},{"$f":"INDEX('Irrig Sched'!$AI$9:$AI$39,MATCH(Q8,'Irrig Sched'!$AF$9:$AF$39,0))","v":"Run"},{"$f":"INDEX('Irrig Sched'!$AI$9:$AI$39,MATCH(R8,'Irrig Sched'!$AF$9:$AF$39,0))","v":""},{"$f":"INDEX('Irrig Sched'!$AI$9:$AI$39,MATCH(S8,'Irrig Sched'!$AF$9:$AF$39,0))","v":""},{"$f":"INDEX('Irrig Sched'!$AI$9:$AI$39,MATCH(T8,'Irrig Sched'!$AF$9:$AF$39,0))","v":""},{"$f":"INDEX('Irrig Sched'!$AI$9:$AI$39,MATCH(U8,'Irrig Sched'!$AF$9:$AF$39,0))","v":"Run"},{"$f":"INDEX('Irrig Sched'!$AX$9:$AX$39,MATCH(V8,'Irrig Sched'!$AU$9:$AU$39,0))","v":""},{"$f":"INDEX('Irrig Sched'!$AX$9:$AX$39,MATCH(W8,'Irrig Sched'!$AU$9:$AU$39,0))","v":""},{"$f":"INDEX('Irrig Sched'!$AX$9:$AX$39,MATCH(X8,'Irrig Sched'!$AU$9:$AU$39,0))","v":""},{"$f":"INDEX('Irrig Sched'!$AX$9:$AX$39,MATCH(Y8,'Irrig Sched'!$AU$9:$AU$39,0))","v":""},{"$f":"INDEX('Irrig Sched'!$AX$9:$AX$39,MATCH(Z8,'Irrig Sched'!$AU$9:$AU$39,0))","v":"Run"},{"$f":"INDEX('Irrig Sched'!$AX$9:$AX$39,MATCH(AA8,'Irrig Sched'!$AU$9:$AU$39,0))","v":""},{"$f":"INDEX('Irrig Sched'!$AX$9:$AX$39,MATCH(AB8,'Irrig Sched'!$AU$9:$AU$39,0))","v":""}]
[{"$f":"IF(AND(YEAR(JanOffset+22)=CalendarYear,MONTH(JanOffset+22)=1),DAY(JanOffset+22),\"\")","v":"1900-01-22"},{"$f":"IF(AND(YEAR(JanOffset+23)=CalendarYear,MONTH(JanOffset+23)=1),DAY(JanOffset+23),\"\")","v":"1900-01-23"},{"$f":"IF(AND(YEAR(JanOffset+24)=CalendarYear,MONTH(JanOffset+24)=1),DAY(JanOffset+24),\"\")","v":"1900-01-24"},{"$f":"IF(AND(YEAR(JanOffset+25)=CalendarYear,MONTH(JanOffset+25)=1),DAY(JanOffset+25),\"\")","v":"1900-01-25"},{"$f":"IF(AND(YEAR(JanOffset+26)=CalendarYear,MONTH(JanOffset+26)=1),DAY(JanOffset+26),\"\")","v":"1900-01-26"},{"$f":"IF(AND(YEAR(JanOffset+27)=CalendarYear,MONTH(JanOffset+27)=1),DAY(JanOffset+27),\"\")","v":"1900-01-27"},{"$f":"IF(AND(YEAR(JanOffset+28)=CalendarYear,MONTH(JanOffset+28)=1),DAY(JanOffset+28),\"\")","v":"1900-01-28"},{"$f":"IF(AND(YEAR(AprOffset+22)=CalendarYear,MONTH(AprOffset+22)=4),DAY(AprOffset+22),\"\")","v":"1900-01-16"},{"$f":"IF(AND(YEAR(AprOffset+23)=CalendarYear,MONTH(AprOffset+23)=4),DAY(AprOffset+23),\"\")","v":"1900-01-17"},{"$f":"IF(AND(YEAR(AprOffset+24)=CalendarYear,MONTH(AprOffset+24)=4),DAY(AprOffset+24),\"\")","v":"1900-01-18"},{"$f":"IF(AND(YEAR(AprOffset+25)=CalendarYear,MONTH(AprOffset+25)=4),DAY(AprOffset+25),\"\")","v":"1900-01-19"},{"$f":"IF(AND(YEAR(AprOffset+26)=CalendarYear,MONTH(AprOffset+26)=4),DAY(AprOffset+26),\"\")","v":"1900-01-20"},{"$f":"IF(AND(YEAR(AprOffset+27)=CalendarYear,MONTH(AprOffset+27)=4),DAY(AprOffset+27),\"\")","v":"1900-01-21"},{"$f":"IF(AND(YEAR(AprOffset+28)=CalendarYear,MONTH(AprOffset+28)=4),DAY(AprOffset+28),\"\")","v":"1900-01-22"},{"$f":"IF(AND(YEAR(JulOffset+22)=CalendarYear,MONTH(JulOffset+22)=7),DAY(JulOffset+22),\"\")","v":"1900-01-16"},{"$f":"IF(AND(YEAR(JulOffset+23)=CalendarYear,MONTH(JulOffset+23)=7),DAY(JulOffset+23),\"\")","v":"1900-01-17"},{"$f":"IF(AND(YEAR(JulOffset+24)=CalendarYear,MONTH(JulOffset+24)=7),DAY(JulOffset+24),\"\")","v":"1900-01-18"},{"$f":"IF(AND(YEAR(JulOffset+25)=CalendarYear,MONTH(JulOffset+25)=7),DAY(JulOffset+25),\"\")","v":"1900-01-19"},{"$f":"IF(AND(YEAR(JulOffset+26)=CalendarYear,MONTH(JulOffset+26)=7),DAY(JulOffset+26),\"\")","v":"1900-01-20"},{"$f":"IF(AND(YEAR(JulOffset+27)=CalendarYear,MONTH(JulOffset+27)=7),DAY(JulOffset+27),\"\")","v":"1900-01-21"},{"$f":"IF(AND(YEAR(JulOffset+28)=CalendarYear,MONTH(JulOffset+28)=7),DAY(JulOffset+28),\"\")","v":"1900-01-22"},{"$f":"IF(AND(YEAR(OctOffset+22)=CalendarYear,MONTH(OctOffset+22)=10),DAY(OctOffset+22),\"\")","v":"1900-01-22"},{"$f":"IF(AND(YEAR(OctOffset+23)=CalendarYear,MONTH(OctOffset+23)=10),DAY(OctOffset+23),\"\")","v":"1900-01-23"},{"$f":"IF(AND(YEAR(OctOffset+24)=CalendarYear,MONTH(OctOffset+24)=10),DAY(OctOffset+24),\"\")","v":"1900-01-24"},{"$f":"IF(AND(YEAR(OctOffset+25)=CalendarYear,MONTH(OctOffset+25)=10),DAY(OctOffset+25),\"\")","v":"1900-01-25"},{"$f":"IF(AND(YEAR(OctOffset+26)=CalendarYear,MONTH(OctOffset+26)=10),DAY(OctOffset+26),\"\")","v":"1900-01-26"},{"$f":"IF(AND(YEAR(OctOffset+27)=CalendarYear,MONTH(OctOffset+27)=10),DAY(OctOffset+27),\"\")","v":"1900-01-27"},{"$f":"IF(AND(YEAR(OctOffset+28)=CalendarYear,MONTH(OctOffset+28)=10),DAY(OctOffset+28),\"\")","v":"1900-01-28"}]
[{"$f":"INDEX('Irrig Sched'!$E$9:$E$39,MATCH(A10,'Irrig Sched'!$B$9:$B$39,0))","v":""},{"$f":"INDEX('Irrig Sched'!$E$9:$E$39,MATCH(B10,'Irrig Sched'!$B$9:$B$39,0))","v":""},{"$f":"INDEX('Irrig Sched'!$E$9:$E$39,MATCH(C10,'Irrig Sched'!$B$9:$B$39,0))","v":"Run"},{"$f":"INDEX('Irrig Sched'!$E$9:$E$39,MATCH(D10,'Irrig Sched'!$B$9:$B$39,0))","v":""},{"$f":"INDEX('Irrig Sched'!$E$9:$E$39,MATCH(E10,'Irrig Sched'!$B$9:$B$39,0))","v":""},{"$f":"INDEX('Irrig Sched'!$E$9:$E$39,MATCH(F10,'Irrig Sched'!$B$9:$B$39,0))","v":""},{"$f":"INDEX('Irrig Sched'!$E$9:$E$39,MATCH(G10,'Irrig Sched'!$B$9:$B$39,0))","v":""},{"$f":"INDEX('Irrig Sched'!$T$9:$T$39,MATCH(H10,'Irrig Sched'!$Q$9:$Q$39,0))","v":""},{"$f":"INDEX('Irrig Sched'!$T$9:$T$39,MATCH(I10,'Irrig Sched'!$Q$9:$Q$39,0))","v":""},{"$f":"INDEX('Irrig Sched'!$T$9:$T$39,MATCH(J10,'Irrig Sched'!$Q$9:$Q$39,0))","v":""},{"$f":"INDEX('Irrig Sched'!$T$9:$T$39,MATCH(K10,'Irrig Sched'!$Q$9:$Q$39,0))","v":""},{"$f":"INDEX('Irrig Sched'!$T$9:$T$39,MATCH(L10,'Irrig Sched'!$Q$9:$Q$39,0))","v":"Run"},{"$f":"INDEX('Irrig Sched'!$T$9:$T$39,MATCH(M10,'Irrig Sched'!$Q$9:$Q$39,0))","v":""},{"$f":"INDEX('Irrig Sched'!$T$9:$T$39,MATCH(N10,'Irrig Sched'!$Q$9:$Q$39,0))","v":""},{"$f":"INDEX('Irrig Sched'!$AI$9:$AI$39,MATCH(O10,'Irrig Sched'!$AF$9:$AF$39,0))","v":""},{"$f":"INDEX('Irrig Sched'!$AI$9:$AI$39,MATCH(P10,'Irrig Sched'!$AF$9:$AF$39,0))","v":""},{"$f":"INDEX('Irrig Sched'!$AI$9:$AI$39,MATCH(Q10,'Irrig Sched'!$AF$9:$AF$39,0))","v":"Run"},{"$f":"INDEX('Irrig Sched'!$AI$9:$AI$39,MATCH(R10,'Irrig Sched'!$AF$9:$AF$39,0))","v":""},{"$f":"INDEX('Irrig Sched'!$AI$9:$AI$39,MATCH(S10,'Irrig Sched'!$AF$9:$AF$39,0))","v":""},{"$f":"INDEX('Irrig Sched'!$AI$9:$AI$39,MATCH(T10,'Irrig Sched'!$AF$9:$AF$39,0))","v":""},{"$f":"INDEX('Irrig Sched'!$AI$9:$AI$39,MATCH(U10,'Irrig Sched'!$AF$9:$AF$39,0))","v":"Run"},{"$f":"INDEX('Irrig Sched'!$AX$9:$AX$39,MATCH(V10,'Irrig Sched'!$AU$9:$AU$39,0))","v":""},{"$f":"INDEX('Irrig Sched'!$AX$9:$AX$39,MATCH(W10,'Irrig Sched'!$AU$9:$AU$39,0))","v":""},{"$f":"INDEX('Irrig Sched'!$AX$9:$AX$39,MATCH(X10,'Irrig Sched'!$AU$9:$AU$39,0))","v":""},{"$f":"INDEX('Irrig Sched'!$AX$9:$AX$39,MATCH(Y10,'Irrig Sched'!$AU$9:$AU$39,0))","v":""},{"$f":"INDEX('Irrig Sched'!$AX$9:$AX$39,MATCH(Z10,'Irrig Sched'!$AU$9:$AU$39,0))","v":""},{"$f":"INDEX('Irrig Sched'!$AX$9:$AX$39,MATCH(AA10,'Irrig Sched'!$AU$9:$AU$39,0))","v":""},{"$f":"INDEX('Irrig Sched'!$AX$9:$AX$39,MATCH(AB10,'Irrig Sched'!$AU$9:$AU$39,0))","v":"Run"}]
[{"$f":"IF(AND(YEAR(JanOffset+29)=CalendarYear,MONTH(JanOffset+29)=1),DAY(JanOffset+29),\"\")","v":"1900-01-29"},{"$f":"IF(AND(YEAR(JanOffset+30)=CalendarYear,MONTH(JanOffset+30)=1),DAY(JanOffset+30),\"\")","v":"1900-01-30"},{"$f":"IF(AND(YEAR(JanOffset+31)=CalendarYear,MONTH(JanOffset+31)=1),DAY(JanOffset+31),\"\")","v":"1900-01-31"},{"$f":"IF(AND(YEAR(JanOffset+32)=CalendarYear,MONTH(JanOffset+32)=1),DAY(JanOffset+32),\"\")","v":""},{"$f":"IF(AND(YEAR(JanOffset+33)=CalendarYear,MONTH(JanOffset+33)=1),DAY(JanOffset+33),\"\")","v":""},{"$f":"IF(AND(YEAR(JanOffset+34)=CalendarYear,MONTH(JanOffset+34)=1),DAY(JanOffset+34),\"\")","v":""},{"$f":"IF(AND(YEAR(JanOffset+35)=CalendarYear,MONTH(JanOffset+35)=1),DAY(JanOffset+35),\"\")","v":""},{"$f":"IF(AND(YEAR(AprOffset+29)=CalendarYear,MONTH(AprOffset+29)=4),DAY(AprOffset+29),\"\")","v":"1900-01-23"},{"$f":"IF(AND(YEAR(AprOffset+30)=CalendarYear,MONTH(AprOffset+30)=4),DAY(AprOffset+30),\"\")","v":"1900-01-24"},{"$f":"IF(AND(YEAR(AprOffset+31)=CalendarYear,MONTH(AprOffset+31)=4),DAY(AprOffset+31),\"\")","v":"1900-01-25"},{"$f":"IF(AND(YEAR(AprOffset+32)=CalendarYear,MONTH(AprOffset+32)=4),DAY(AprOffset+32),\"\")","v":"1900-01-26"},{"$f":"IF(AND(YEAR(AprOffset+33)=CalendarYear,MONTH(AprOffset+33)=4),DAY(AprOffset+33),\"\")","v":"1900-01-27"},{"$f":"IF(AND(YEAR(AprOffset+34)=CalendarYear,MONTH(AprOffset+34)=4),DAY(AprOffset+34),\"\")","v":"1900-01-28"},{"$f":"IF(AND(YEAR(AprOffset+35)=CalendarYear,MONTH(AprOffset+35)=4),DAY(AprOffset+35),\"\")","v":"1900-01-29"},{"$f":"IF(AND(YEAR(JulOffset+29)=CalendarYear,MONTH(JulOffset+29)=7),DAY(JulOffset+29),\"\")","v":"1900-01-23"},{"$f":"IF(AND(YEAR(JulOffset+30)=CalendarYear,MONTH(JulOffset+30)=7),DAY(JulOffset+30),\"\")","v":"1900-01-24"},{"$f":"IF(AND(YEAR(JulOffset+31)=CalendarYear,MONTH(JulOffset+31)=7),DAY(JulOffset+31),\"\")","v":"1900-01-25"},{"$f":"IF(AND(YEAR(JulOffset+32)=CalendarYear,MONTH(JulOffset+32)=7),DAY(JulOffset+32),\"\")","v":"1900-01-26"},{"$f":"IF(AND(YEAR(JulOffset+33)=CalendarYear,MONTH(JulOffset+33)=7),DAY(JulOffset+33),\"\")","v":"1900-01-27"},{"$f":"IF(AND(YEAR(JulOffset+34)=CalendarYear,MONTH(JulOffset+34)=7),DAY(JulOffset+34),\"\")","v":"1900-01-28"},{"$f":"IF(AND(YEAR(JulOffset+35)=CalendarYear,MONTH(JulOffset+35)=7),DAY(JulOffset+35),\"\")","v":"1900-01-29"},{"$f":"IF(AND(YEAR(OctOffset+29)=CalendarYear,MONTH(OctOffset+29)=10),DAY(OctOffset+29),\"\")","v":"1900-01-29"},{"$f":"IF(AND(YEAR(OctOffset+30)=CalendarYear,MONTH(OctOffset+30)=10),DAY(OctOffset+30),\"\")","v":"1900-01-30"},{"$f":"IF(AND(YEAR(OctOffset+31)=CalendarYear,MONTH(OctOffset+31)=10),DAY(OctOffset+31),\"\")","v":"1900-01-31"},{"$f":"IF(AND(YEAR(OctOffset+32)=CalendarYear,MONTH(OctOffset+32)=10),DAY(OctOffset+32),\"\")","v":""},{"$f":"IF(AND(YEAR(OctOffset+33)=CalendarYear,MONTH(OctOffset+33)=10),DAY(OctOffset+33),\"\")","v":""},{"$f":"IF(AND(YEAR(OctOffset+34)=CalendarYear,MONTH(OctOffset+34)=10),DAY(OctOffset+34),\"\")","v":""},{"$f":"IF(AND(YEAR(OctOffset+35)=CalendarYear,MONTH(OctOffset+35)=10),DAY(OctOffset+35),\"\")","v":""}]
[{"$f":"INDEX('Irrig Sched'!$E$9:$E$39,MATCH(A12,'Irrig Sched'!$B$9:$B$39,0))","v":""},{"$f":"INDEX('Irrig Sched'!$E$9:$E$39,MATCH(B12,'Irrig Sched'!$B$9:$B$39,0))","v":""},{"$f":"INDEX('Irrig Sched'!$E$9:$E$39,MATCH(C12,'Irrig Sched'!$B$9:$B$39,0))","v":""},{"$f":"IF(D12=\"\",\"\",INDEX('Irrig Sched'!$E$9:$E$39,MATCH(D12,'Irrig Sched'!$B$9:$B$39,0)))","v":""},{"$f":"IF(E12=\"\",\"\",INDEX('Irrig Sched'!$E$9:$E$39,MATCH(E12,'Irrig Sched'!$B$9:$B$39,0)))","v":""},{"$f":"IF(F12=\"\",\"\",INDEX('Irrig Sched'!$E$9:$E$39,MATCH(F12,'Irrig Sched'!$B$9:$B$39,0)))","v":""},{"$f":"IF(G12=\"\",\"\",INDEX('Irrig Sched'!$E$9:$E$39,MATCH(G12,'Irrig Sched'!$B$9:$B$39,0)))","v":""},{"$f":"IF(H12=\"\",\"\",INDEX('Irrig Sched'!$T$9:$T$39,MATCH(H12,'Irrig Sched'!$Q$9:$Q$39,0)))","v":""},{"$f":"IF(I12=\"\",\"\",INDEX('Irrig Sched'!$T$9:$T$39,MATCH(I12,'Irrig Sched'!$Q$9:$Q$39,0)))","v":""},{"$f":"IF(J12=\"\",\"\",INDEX('Irrig Sched'!$T$9:$T$39,MATCH(J12,'Irrig Sched'!$Q$9:$Q$39,0)))","v":""},{"$f":"IF(K12=\"\",\"\",INDEX('Irrig Sched'!$T$9:$T$39,MATCH(K12,'Irrig Sched'!$Q$9:$Q$39,0)))","v":""},{"$f":"IF(L12=\"\",\"\",INDEX('Irrig Sched'!$T$9:$T$39,MATCH(L12,'Irrig Sched'!$Q$9:$Q$39,0)))","v":"Run"},{"$f":"IF(M12=\"\",\"\",INDEX('Irrig Sched'!$T$9:$T$39,MATCH(M12,'Irrig Sched'!$Q$9:$Q$39,0)))","v":""},{"$f":"IF(N12=\"\",\"\",INDEX('Irrig Sched'!$T$9:$T$39,MATCH(N12,'Irrig Sched'!$Q$9:$Q$39,0)))","v":""},{"$f":"IF(O12=\"\",\"\",INDEX('Irrig Sched'!$AI$9:$AI$39,MATCH(O12,'Irrig Sched'!$AF$9:$AF$39,0)))","v":""},{"$f":"IF(P12=\"\",\"\",INDEX('Irrig Sched'!$AI$9:$AI$39,MATCH(P12,'Irrig Sched'!$AF$9:$AF$39,0)))","v":""},{"$f":"IF(Q12=\"\",\"\",INDEX('Irrig Sched'!$AI$9:$AI$39,MATCH(Q12,'Irrig Sched'!$AF$9:$AF$39,0)))","v":""},{"$f":"IF(R12=\"\",\"\",INDEX('Irrig Sched'!$AI$9:$AI$39,MATCH(R12,'Irrig Sched'!$AF$9:$AF$39,0)))","v":""},{"$f":"IF(S12=\"\",\"\",INDEX('Irrig Sched'!$AI$9:$AI$39,MATCH(S12,'Irrig Sched'!$AF$9:$AF$39,0)))","v":"Run"},{"$f":"IF(T12=\"\",\"\",INDEX('Irrig Sched'!$AI$9:$AI$39,MATCH(T12,'Irrig Sched'!$AF$9:$AF$39,0)))","v":""},{"$f":"IF(U12=\"\",\"\",INDEX('Irrig Sched'!$AI$9:$AI$39,MATCH(U12,'Irrig Sched'!$AF$9:$AF$39,0)))","v":""},{"$f":"IF(V12=\"\",\"\",INDEX('Irrig Sched'!$AX$9:$AX$39,MATCH(V12,'Irrig Sched'!$AU$9:$AU$39,0)))","v":""},{"$f":"IF(W12=\"\",\"\",INDEX('Irrig Sched'!$AX$9:$AX$39,MATCH(W12,'Irrig Sched'!$AU$9:$AU$39,0)))","v":""},{"$f":"IF(X12=\"\",\"\",INDEX('Irrig Sched'!$AX$9:$AX$39,MATCH(X12,'Irrig Sched'!$AU$9:$AU$39,0)))","v":""},{"$f":"IF(Y12=\"\",\"\",INDEX('Irrig Sched'!$AX$9:$AX$39,MATCH(Y12,'Irrig Sched'!$AU$9:$AU$39,0)))","v":""},{"$f":"IF(Z12=\"\",\"\",INDEX('Irrig Sched'!$AX$9:$AX$39,MATCH(Z12,'Irrig Sched'!$AU$9:$AU$39,0)))","v":""},{"$f":"IF(AA12=\"\",\"\",INDEX('Irrig Sched'!$AX$9:$AX$39,MATCH(AA12,'Irrig Sched'!$AU$9:$AU$39,0)))","v":""},{"$f":"IF(AB12=\"\",\"\",INDEX('Irrig Sched'!$AX$9:$AX$39,MATCH(AB12,'Irrig Sched'!$AU$9:$AU$39,0)))","v":""}]
[{"$f":"IF(AND(YEAR(JanOffset+36)=CalendarYear,MONTH(JanOffset+36)=1),DAY(JanOffset+36),\"\")","v":""},{"$f":"IF(AND(YEAR(JanOffset+37)=CalendarYear,MONTH(JanOffset+37)=1),DAY(JanOffset+37),\"\")","v":""},null,null,null,null,null,{"$f":"IF(AND(YEAR(AprOffset+36)=CalendarYear,MONTH(AprOffset+36)=4),DAY(AprOffset+36),\"\")","v":"1900-01-30"},{"$f":"IF(AND(YEAR(AprOffset+37)=CalendarYear,MONTH(AprOffset+37)=4),DAY(AprOffset+37),\"\")","v":""},null,null,null,null,null,{"$f":"IF(AND(YEAR(JulOffset+36)=CalendarYear,MONTH(JulOffset+36)=7),DAY(JulOffset+36),\"\")","v":"1900-01-30"},{"$f":"IF(AND(YEAR(JulOffset+37)=CalendarYear,MONTH(JulOffset+37)=7),DAY(JulOffset+37),\"\")","v":"1900-01-31"},null,null,null,null,null,{"$f":"IF(AND(YEAR(OctOffset+36)=CalendarYear,MONTH(OctOffset+36)=10),DAY(OctOffset+36),\"\")","v":""},{"$f":"IF(AND(YEAR(OctOffset+37)=CalendarYear,MONTH(OctOffset+37)=10),DAY(OctOffset+37),\"\")","v":""}]
[{"$f":"IF(A14=\"\",\"\",INDEX('Irrig Sched'!$E$9:$E$39,MATCH(A14,'Irrig Sched'!$B$9:$B$39,0)))","v":""},{"$f":"IF(B14=\"\",\"\",INDEX('Irrig Sched'!$E$9:$E$39,MATCH(B14,'Irrig Sched'!$B$9:$B$39,0)))","v":""},null,null,null,null,null,{"$f":"IF(H14=\"\",\"\",INDEX('Irrig Sched'!$T$9:$T$39,MATCH(H14,'Irrig Sched'!$Q$9:$Q$39,0)))","v":""},{"$f":"IF(I14=\"\",\"\",INDEX('Irrig Sched'!$T$9:$T$39,MATCH(I14,'Irrig Sched'!$Q$9:$Q$39,0)))","v":""},null,null,null,null,null,{"$f":"IF(O14=\"\",\"\",INDEX('Irrig Sched'!$AI$9:$AI$39,MATCH(O14,'Irrig Sched'!$AF$9:$AF$39,0)))","v":""},{"$f":"IF(P14=\"\",\"\",INDEX('Irrig Sched'!$AI$9:$AI$39,MATCH(P14,'Irrig Sched'!$AF$9:$AF$39,0)))","v":""},null,null,null,null,null,{"$f":"IF(V14=\"\",\"\",INDEX('Irrig Sched'!$AX$9:$AX$39,MATCH(V14,'Irrig Sched'!$AU$9:$AU$39,0)))","v":""},{"$f":"IF(W14=\"\",\"\",INDEX('Irrig Sched'!$AX$9:$AX$39,MATCH(W14,'Irrig Sched'!$AU$9:$AU$39,0)))","v":""}]
[]
[{"$f":"CONCATENATE(\"February \",Irrig_Year)","v":"February 2017"},null,null,null,null,null,null,{"$f":"CONCATENATE(\"May \",Irrig_Year)","v":"May 2017"},null,null,null,null,null,null,{"$f":"CONCATENATE(\"August \",Irrig_Year)","v":"August 2017"},null,null,null,null,null,null,{"$f":"CONCATENATE(\"November \",Irrig_Year)","v":"November 2017"}]
["SUNDAY","MONDAY","TUESDAY","WEDNESDAY","THURSDAY","FRIDAY","SATURDAY","SUNDAY","MONDAY","TUESDAY","WEDNESDAY","THURSDAY","FRIDAY","SATURDAY","SUNDAY","MONDAY","TUESDAY","WEDNESDAY","THURSDAY","FRIDAY","SATURDAY","SUNDAY","MONDAY","TUESDAY","WEDNESDAY","THURSDAY","FRIDAY","SATURDAY"]
[{"$f":"IF(AND(YEAR(FebOffset+1)=CalendarYear,MONTH(FebOffset+1)=2),DAY(FebOffset+1),\"\")","v":""},{"$f":"IF(AND(YEAR(FebOffset+2)=CalendarYear,MONTH(FebOffset+2)=2),DAY(FebOffset+2),\"\")","v":""},{"$f":"IF(AND(YEAR(FebOffset+3)=CalendarYear,MONTH(FebOffset+3)=2),DAY(FebOffset+3),\"\")","v":""},{"$f":"IF(AND(YEAR(FebOffset+4)=CalendarYear,MONTH(FebOffset+4)=2),DAY(FebOffset+4),\"\")","v":"1900-01-01"},{"$f":"IF(AND(YEAR(FebOffset+5)=CalendarYear,MONTH(FebOffset+5)=2),DAY(FebOffset+5),\"\")","v":"1900-01-02"},{"$f":"IF(AND(YEAR(FebOffset+6)=CalendarYear,MONTH(FebOffset+6)=2),DAY(FebOffset+6),\"\")","v":"1900-01-03"},{"$f":"IF(AND(YEAR(FebOffset+7)=CalendarYear,MONTH(FebOffset+7)=2),DAY(FebOffset+7),\"\")","v":"1900-01-04"},{"$f":"IF(AND(YEAR(MayOffset+1)=CalendarYear,MONTH(MayOffset+1)=5),DAY(MayOffset+1),\"\")","v":""},{"$f":"IF(AND(YEAR(MayOffset+2)=CalendarYear,MONTH(MayOffset+2)=5),DAY(MayOffset+2),\"\")","v":"1900-01-01"},{"$f":"IF(AND(YEAR(MayOffset+3)=CalendarYear,MONTH(MayOffset+3)=5),DAY(MayOffset+3),\"\")","v":"1900-01-02"},{"$f":"IF(AND(YEAR(MayOffset+4)=CalendarYear,MONTH(MayOffset+4)=5),DAY(MayOffset+4),\"\")","v":"1900-01-03"},{"$f":"IF(AND(YEAR(MayOffset+5)=CalendarYear,MONTH(MayOffset+5)=5),DAY(MayOffset+5),\"\")","v":"1900-01-04"},{"$f":"IF(AND(YEAR(MayOffset+6)=CalendarYear,MONTH(MayOffset+6)=5),DAY(MayOffset+6),\"\")","v":"1900-01-05"},{"$f":"IF(AND(YEAR(MayOffset+7)=CalendarYear,MONTH(MayOffset+7)=5),DAY(MayOffset+7),\"\")","v":"1900-01-06"},{"$f":"IF(AND(YEAR(AugOffset+1)=CalendarYear,MONTH(AugOffset+1)=8),DAY(AugOffset+1),\"\")","v":""},{"$f":"IF(AND(YEAR(AugOffset+2)=CalendarYear,MONTH(AugOffset+2)=8),DAY(AugOffset+2),\"\")","v":""},{"$f":"IF(AND(YEAR(AugOffset+3)=CalendarYear,MONTH(AugOffset+3)=8),DAY(AugOffset+3),\"\")","v":"1900-01-01"},{"$f":"IF(AND(YEAR(AugOffset+4)=CalendarYear,MONTH(AugOffset+4)=8),DAY(AugOffset+4),\"\")","v":"1900-01-02"},{"$f":"IF(AND(YEAR(AugOffset+5)=CalendarYear,MONTH(AugOffset+5)=8),DAY(AugOffset+5),\"\")","v":"1900-01-03"},{"$f":"IF(AND(YEAR(AugOffset+6)=CalendarYear,MONTH(AugOffset+6)=8),DAY(AugOffset+6),\"\")","v":"1900-01-04"},{"$f":"IF(AND(YEAR(AugOffset+7)=CalendarYear,MONTH(AugOffset+7)=8),DAY(AugOffset+7),\"\")","v":"1900-01-05"},{"$f":"IF(AND(YEAR(NovOffset+1)=CalendarYear,MONTH(NovOffset+1)=11),DAY(NovOffset+1),\"\")","v":""},{"$f":"IF(AND(YEAR(NovOffset+2)=CalendarYear,MONTH(NovOffset+2)=11),DAY(NovOffset+2),\"\")","v":""},{"$f":"IF(AND(YEAR(NovOffset+3)=CalendarYear,MONTH(NovOffset+3)=11),DAY(NovOffset+3),\"\")","v":""},{"$f":"IF(AND(YEAR(NovOffset+4)=CalendarYear,MONTH(NovOffset+4)=11),DAY(NovOffset+4),\"\")","v":"1900-01-01"},{"$f":"IF(AND(YEAR(NovOffset+5)=CalendarYear,MONTH(NovOffset+5)=11),DAY(NovOffset+5),\"\")","v":"1900-01-02"},{"$f":"IF(AND(YEAR(NovOffset+6)=CalendarYear,MONTH(NovOffset+6)=11),DAY(NovOffset+6),\"\")","v":"1900-01-03"},{"$f":"IF(AND(YEAR(NovOffset+7)=CalendarYear,MONTH(NovOffset+7)=11),DAY(NovOffset+7),\"\")","v":"1900-01-04"}]
[{"$f":"IF(A19=\"\",\"\",INDEX('Irrig Sched'!$J$9:$J$37,MATCH(A19,'Irrig Sched'!$G$9:$G$37,0)))","v":""},{"$f":"IF(B19=\"\",\"\",INDEX('Irrig Sched'!$J$9:$J$37,MATCH(B19,'Irrig Sched'!$G$9:$G$37,0)))","v":""},{"$f":"IF(C19=\"\",\"\",INDEX('Irrig Sched'!$J$9:$J$37,MATCH(C19,'Irrig Sched'!$G$9:$G$37,0)))","v":""},{"$f":"IF(D19=\"\",\"\",INDEX('Irrig Sched'!$J$9:$J$37,MATCH(D19,'Irrig Sched'!$G$9:$G$37,0)))","v":""},{"$f":"IF(E19=\"\",\"\",INDEX('Irrig Sched'!$J$9:$J$37,MATCH(E19,'Irrig Sched'!$G$9:$G$37,0)))","v":""},{"$f":"IF(F19=\"\",\"\",INDEX('Irrig Sched'!$J$9:$J$37,MATCH(F19,'Irrig Sched'!$G$9:$G$37,0)))","v":""},{"$f":"IF(G19=\"\",\"\",INDEX('Irrig Sched'!$J$9:$J$37,MATCH(G19,'Irrig Sched'!$G$9:$G$37,0)))","v":""},{"$f":"IF(H19=\"\",\"\",INDEX('Irrig Sched'!$Y$9:$Y$39,MATCH(H19,'Irrig Sched'!$V$9:$V$39,0)))","v":""},{"$f":"IF(I19=\"\",\"\",INDEX('Irrig Sched'!$Y$9:$Y$39,MATCH(I19,'Irrig Sched'!$V$9:$V$39,0)))","v":""},{"$f":"IF(J19=\"\",\"\",INDEX('Irrig Sched'!$Y$9:$Y$39,MATCH(J19,'Irrig Sched'!$V$9:$V$39,0)))","v":"Run"},{"$f":"IF(K19=\"\",\"\",INDEX('Irrig Sched'!$Y$9:$Y$39,MATCH(K19,'Irrig Sched'!$V$9:$V$39,0)))","v":""},{"$f":"IF(L19=\"\",\"\",INDEX('Irrig Sched'!$Y$9:$Y$39,MATCH(L19,'Irrig Sched'!$V$9:$V$39,0)))","v":""},{"$f":"IF(M19=\"\",\"\",INDEX('Irrig Sched'!$Y$9:$Y$39,MATCH(M19,'Irrig Sched'!$V$9:$V$39,0)))","v":""},{"$f":"IF(N19=\"\",\"\",INDEX('Irrig Sched'!$Y$9:$Y$39,MATCH(N19,'Irrig Sched'!$V$9:$V$39,0)))","v":""},{"$f":"IF(O19=\"\",\"\",INDEX('Irrig Sched'!$AN$9:$AN$39,MATCH(O19,'Irrig Sched'!$AK$9:$AK$39,0)))","v":""},{"$f":"IF(P19=\"\",\"\",INDEX('Irrig Sched'!$AN$9:$AN$39,MATCH(P19,'Irrig Sched'!$AK$9:$AK$39,0)))","v":""},{"$f":"IF(Q19=\"\",\"\",INDEX('Irrig Sched'!$AN$9:$AN$39,MATCH(Q19,'Irrig Sched'!$AK$9:$AK$39,0)))","v":"Run"},{"$f":"IF(R19=\"\",\"\",INDEX('Irrig Sched'!$AN$9:$AN$39,MATCH(R19,'Irrig Sched'!$AK$9:$AK$39,0)))","v":""},{"$f":"IF(S19=\"\",\"\",INDEX('Irrig Sched'!$AN$9:$AN$39,MATCH(S19,'Irrig Sched'!$AK$9:$AK$39,0)))","v":"Run"},{"$f":"IF(T19=\"\",\"\",INDEX('Irrig Sched'!$AN$9:$AN$39,MATCH(T19,'Irrig Sched'!$AK$9:$AK$39,0)))","v":""},{"$f":"IF(U19=\"\",\"\",INDEX('Irrig Sched'!$AN$9:$AN$39,MATCH(U19,'Irrig Sched'!$AK$9:$AK$39,0)))","v":""},{"$f":"IF(V19=\"\",\"\",INDEX('Irrig Sched'!$BC$9:$BC$39,MATCH(V19,'Irrig Sched'!$AZ$9:$AZ$39,0)))","v":""},{"$f":"IF(W19=\"\",\"\",INDEX('Irrig Sched'!$BC$9:$BC$39,MATCH(W19,'Irrig Sched'!$AZ$9:$AZ$39,0)))","v":""},{"$f":"IF(X19=\"\",\"\",INDEX('Irrig Sched'!$BC$9:$BC$39,MATCH(X19,'Irrig Sched'!$AZ$9:$AZ$39,0)))","v":""},{"$f":"IF(Y19=\"\",\"\",INDEX('Irrig Sched'!$BC$9:$BC$39,MATCH(Y19,'Irrig Sched'!$AZ$9:$AZ$39,0)))","v":""},{"$f":"IF(Z19=\"\",\"\",INDEX('Irrig Sched'!$BC$9:$BC$39,MATCH(Z19,'Irrig Sched'!$AZ$9:$AZ$39,0)))","v":""},{"$f":"IF(AA19=\"\",\"\",INDEX('Irrig Sched'!$BC$9:$BC$39,MATCH(AA19,'Irrig Sched'!$AZ$9:$AZ$39,0)))","v":""},{"$f":"IF(AB19=\"\",\"\",INDEX('Irrig Sched'!$BC$9:$BC$39,MATCH(AB19,'Irrig Sched'!$AZ$9:$AZ$39,0)))","v":""}]
[{"$f":"IF(AND(YEAR(FebOffset+8)=CalendarYear,MONTH(FebOffset+8)=2),DAY(FebOffset+8),\"\")","v":"1900-01-05"},{"$f":"IF(AND(YEAR(FebOffset+9)=CalendarYear,MONTH(FebOffset+9)=2),DAY(FebOffset+9),\"\")","v":"1900-01-06"},{"$f":"IF(AND(YEAR(FebOffset+10)=CalendarYear,MONTH(FebOffset+10)=2),DAY(FebOffset+10),\"\")","v":"1900-01-07"},{"$f":"IF(AND(YEAR(FebOffset+11)=CalendarYear,MONTH(FebOffset+11)=2),DAY(FebOffset+11),\"\")","v":"1900-01-08"},{"$f":"IF(AND(YEAR(FebOffset+12)=CalendarYear,MONTH(FebOffset+12)=2),DAY(FebOffset+12),\"\")","v":"1900-01-09"},{"$f":"IF(AND(YEAR(FebOffset+13)=CalendarYear,MONTH(FebOffset+13)=2),DAY(FebOffset+13),\"\")","v":"1900-01-10"},{"$f":"IF(AND(YEAR(FebOffset+14)=CalendarYear,MONTH(FebOffset+14)=2),DAY(FebOffset+14),\"\")","v":"1900-01-11"},{"$f":"IF(AND(YEAR(MayOffset+8)=CalendarYear,MONTH(MayOffset+8)=5),DAY(MayOffset+8),\"\")","v":"1900-01-07"},{"$f":"IF(AND(YEAR(MayOffset+9)=CalendarYear,MONTH(MayOffset+9)=5),DAY(MayOffset+9),\"\")","v":"1900-01-08"},{"$f":"IF(AND(YEAR(MayOffset+10)=CalendarYear,MONTH(MayOffset+10)=5),DAY(MayOffset+10),\"\")","v":"1900-01-09"},{"$f":"IF(AND(YEAR(MayOffset+11)=CalendarYear,MONTH(MayOffset+11)=5),DAY(MayOffset+11),\"\")","v":"1900-01-10"},{"$f":"IF(AND(YEAR(MayOffset+12)=CalendarYear,MONTH(MayOffset+12)=5),DAY(MayOffset+12),\"\")","v":"1900-01-11"},{"$f":"IF(AND(YEAR(MayOffset+13)=CalendarYear,MONTH(MayOffset+13)=5),DAY(MayOffset+13),\"\")","v":"1900-01-12"},{"$f":"IF(AND(YEAR(MayOffset+14)=CalendarYear,MONTH(MayOffset+14)=5),DAY(MayOffset+14),\"\")","v":"1900-01-13"},{"$f":"IF(AND(YEAR(AugOffset+8)=CalendarYear,MONTH(AugOffset+8)=8),DAY(AugOffset+8),\"\")","v":"1900-01-06"},{"$f":"IF(AND(YEAR(AugOffset+9)=CalendarYear,MONTH(AugOffset+9)=8),DAY(AugOffset+9),\"\")","v":"1900-01-07"},{"$f":"IF(AND(YEAR(AugOffset+10)=CalendarYear,MONTH(AugOffset+10)=8),DAY(AugOffset+10),\"\")","v":"1900-01-08"},{"$f":"IF(AND(YEAR(AugOffset+11)=CalendarYear,MONTH(AugOffset+11)=8),DAY(AugOffset+11),\"\")","v":"1900-01-09"},{"$f":"IF(AND(YEAR(AugOffset+12)=CalendarYear,MONTH(AugOffset+12)=8),DAY(AugOffset+12),\"\")","v":"1900-01-10"},{"$f":"IF(AND(YEAR(AugOffset+13)=CalendarYear,MONTH(AugOffset+13)=8),DAY(AugOffset+13),\"\")","v":"1900-01-11"},{"$f":"IF(AND(YEAR(AugOffset+14)=CalendarYear,MONTH(AugOffset+14)=8),DAY(AugOffset+14),\"\")","v":"1900-01-12"},{"$f":"IF(AND(YEAR(NovOffset+8)=CalendarYear,MONTH(NovOffset+8)=11),DAY(NovOffset+8),\"\")","v":"1900-01-05"},{"$f":"IF(AND(YEAR(NovOffset+9)=CalendarYear,MONTH(NovOffset+9)=11),DAY(NovOffset+9),\"\")","v":"1900-01-06"},{"$f":"IF(AND(YEAR(NovOffset+10)=CalendarYear,MONTH(NovOffset+10)=11),DAY(NovOffset+10),\"\")","v":"1900-01-07"},{"$f":"IF(AND(YEAR(NovOffset+11)=CalendarYear,MONTH(NovOffset+11)=11),DAY(NovOffset+11),\"\")","v":"1900-01-08"},{"$f":"IF(AND(YEAR(NovOffset+12)=CalendarYear,MONTH(NovOffset+12)=11),DAY(NovOffset+12),\"\")","v":"1900-01-09"},{"$f":"IF(AND(YEAR(NovOffset+13)=CalendarYear,MONTH(NovOffset+13)=11),DAY(NovOffset+13),\"\")","v":"1900-01-10"},{"$f":"IF(AND(YEAR(NovOffset+14)=CalendarYear,MONTH(NovOffset+14)=11),DAY(NovOffset+14),\"\")","v":"1900-01-11"}]
[{"$f":"INDEX('Irrig Sched'!$J$9:$J$37,MATCH(A21,'Irrig Sched'!$G$9:$G$37,0))","v":""},{"$f":"INDEX('Irrig Sched'!$J$9:$J$37,MATCH(B21,'Irrig Sched'!$G$9:$G$37,0))","v":""},{"$f":"INDEX('Irrig Sched'!$J$9:$J$37,MATCH(C21,'Irrig Sched'!$G$9:$G$37,0))","v":""},{"$f":"INDEX('Irrig Sched'!$J$9:$J$37,MATCH(D21,'Irrig Sched'!$G$9:$G$37,0))","v":""},{"$f":"INDEX('Irrig Sched'!$J$9:$J$37,MATCH(E21,'Irrig Sched'!$G$9:$G$37,0))","v":"Run"},{"$f":"INDEX('Irrig Sched'!$J$9:$J$37,MATCH(F21,'Irrig Sched'!$G$9:$G$37,0))","v":""},{"$f":"INDEX('Irrig Sched'!$J$9:$J$37,MATCH(G21,'Irrig Sched'!$G$9:$G$37,0))","v":""},{"$f":"INDEX('Irrig Sched'!$Y$9:$Y$39,MATCH(H21,'Irrig Sched'!$V$9:$V$39,0))","v":""},{"$f":"INDEX('Irrig Sched'!$Y$9:$Y$39,MATCH(I21,'Irrig Sched'!$V$9:$V$39,0))","v":""},{"$f":"INDEX('Irrig Sched'!$Y$9:$Y$39,MATCH(J21,'Irrig Sched'!$V$9:$V$39,0))","v":"Run"},{"$f":"INDEX('Irrig Sched'!$Y$9:$Y$39,MATCH(K21,'Irrig Sched'!$V$9:$V$39,0))","v":""},{"$f":"INDEX('Irrig Sched'!$Y$9:$Y$39,MATCH(L21,'Irrig Sched'!$V$9:$V$39,0))","v":"Run"},{"$f":"INDEX('Irrig Sched'!$Y$9:$Y$39,MATCH(M21,'Irrig Sched'!$V$9:$V$39,0))","v":""},{"$f":"INDEX('Irrig Sched'!$Y$9:$Y$39,MATCH(N21,'Irrig Sched'!$V$9:$V$39,0))","v":""},{"$f":"INDEX('Irrig Sched'!$AN$9:$AN$39,MATCH(O21,'Irrig Sched'!$AK$9:$AK$39,0))","v":""},{"$f":"INDEX('Irrig Sched'!$AN$9:$AN$39,MATCH(P21,'Irrig Sched'!$AK$9:$AK$39,0))","v":""},{"$f":"INDEX('Irrig Sched'!$AN$9:$AN$39,MATCH(Q21,'Irrig Sched'!$AK$9:$AK$39,0))","v":"Run"},{"$f":"INDEX('Irrig Sched'!$AN$9:$AN$39,MATCH(R21,'Irrig Sched'!$AK$9:$AK$39,0))","v":""},{"$f":"INDEX('Irrig Sched'!$AN$9:$AN$39,MATCH(S21,'Irrig Sched'!$AK$9:$AK$39,0))","v":""},{"$f":"INDEX('Irrig Sched'!$AN$9:$AN$39,MATCH(T21,'Irrig Sched'!$AK$9:$AK$39,0))","v":""},{"$f":"INDEX('Irrig Sched'!$AN$9:$AN$39,MATCH(U21,'Irrig Sched'!$AK$9:$AK$39,0))","v":"Run"},{"$f":"INDEX('Irrig Sched'!$BC$9:$BC$39,MATCH(V21,'Irrig Sched'!$AZ$9:$AZ$39,0))","v":""},{"$f":"INDEX('Irrig Sched'!$BC$9:$BC$39,MATCH(W21,'Irrig Sched'!$AZ$9:$AZ$39,0))","v":""},{"$f":"INDEX('Irrig Sched'!$BC$9:$BC$39,MATCH(X21,'Irrig Sched'!$AZ$9:$AZ$39,0))","v":"Run"},{"$f":"INDEX('Irrig Sched'!$BC$9:$BC$39,MATCH(Y21,'Irrig Sched'!$AZ$9:$AZ$39,0))","v":""},{"$f":"INDEX('Irrig Sched'!$BC$9:$BC$39,MATCH(Z21,'Irrig Sched'!$AZ$9:$AZ$39,0))","v":""},{"$f":"INDEX('Irrig Sched'!$BC$9:$BC$39,MATCH(AA21,'Irrig Sched'!$AZ$9:$AZ$39,0))","v":""},{"$f":"INDEX('Irrig Sched'!$BC$9:$BC$39,MATCH(AB21,'Irrig Sched'!$AZ$9:$AZ$39,0))","v":""}]
[{"$f":"IF(AND(YEAR(FebOffset+15)=CalendarYear,MONTH(FebOffset+15)=2),DAY(FebOffset+15),\"\")","v":"1900-01-12"},{"$f":"IF(AND(YEAR(FebOffset+16)=CalendarYear,MONTH(FebOffset+16)=2),DAY(FebOffset+16),\"\")","v":"1900-01-13"},{"$f":"IF(AND(YEAR(FebOffset+17)=CalendarYear,MONTH(FebOffset+17)=2),DAY(FebOffset+17),\"\")","v":"1900-01-14"},{"$f":"IF(AND(YEAR(FebOffset+18)=CalendarYear,MONTH(FebOffset+18)=2),DAY(FebOffset+18),\"\")","v":"1900-01-15"},{"$f":"IF(AND(YEAR(FebOffset+19)=CalendarYear,MONTH(FebOffset+19)=2),DAY(FebOffset+19),\"\")","v":"1900-01-16"},{"$f":"IF(AND(YEAR(FebOffset+20)=CalendarYear,MONTH(FebOffset+20)=2),DAY(FebOffset+20),\"\")","v":"1900-01-17"},{"$f":"IF(AND(YEAR(FebOffset+21)=CalendarYear,MONTH(FebOffset+21)=2),DAY(FebOffset+21),\"\")","v":"1900-01-18"},{"$f":"IF(AND(YEAR(MayOffset+15)=CalendarYear,MONTH(MayOffset+15)=5),DAY(MayOffset+15),\"\")","v":"1900-01-14"},{"$f":"IF(AND(YEAR(MayOffset+16)=CalendarYear,MONTH(MayOffset+16)=5),DAY(MayOffset+16),\"\")","v":"1900-01-15"},{"$f":"IF(AND(YEAR(MayOffset+17)=CalendarYear,MONTH(MayOffset+17)=5),DAY(MayOffset+17),\"\")","v":"1900-01-16"},{"$f":"IF(AND(YEAR(MayOffset+18)=CalendarYear,MONTH(MayOffset+18)=5),DAY(MayOffset+18),\"\")","v":"1900-01-17"},{"$f":"IF(AND(YEAR(MayOffset+19)=CalendarYear,MONTH(MayOffset+19)=5),DAY(MayOffset+19),\"\")","v":"1900-01-18"},{"$f":"IF(AND(YEAR(MayOffset+20)=CalendarYear,MONTH(MayOffset+20)=5),DAY(MayOffset+20),\"\")","v":"1900-01-19"},{"$f":"IF(AND(YEAR(MayOffset+21)=CalendarYear,MONTH(MayOffset+21)=5),DAY(MayOffset+21),\"\")","v":"1900-01-20"},{"$f":"IF(AND(YEAR(AugOffset+15)=CalendarYear,MONTH(AugOffset+15)=8),DAY(AugOffset+15),\"\")","v":"1900-01-13"},{"$f":"IF(AND(YEAR(AugOffset+16)=CalendarYear,MONTH(AugOffset+16)=8),DAY(AugOffset+16),\"\")","v":"1900-01-14"},{"$f":"IF(AND(YEAR(AugOffset+17)=CalendarYear,MONTH(AugOffset+17)=8),DAY(AugOffset+17),\"\")","v":"1900-01-15"},{"$f":"IF(AND(YEAR(AugOffset+18)=CalendarYear,MONTH(AugOffset+18)=8),DAY(AugOffset+18),\"\")","v":"1900-01-16"},{"$f":"IF(AND(YEAR(AugOffset+19)=CalendarYear,MONTH(AugOffset+19)=8),DAY(AugOffset+19),\"\")","v":"1900-01-17"},{"$f":"IF(AND(YEAR(AugOffset+20)=CalendarYear,MONTH(AugOffset+20)=8),DAY(AugOffset+20),\"\")","v":"1900-01-18"},{"$f":"IF(AND(YEAR(AugOffset+21)=CalendarYear,MONTH(AugOffset+21)=8),DAY(AugOffset+21),\"\")","v":"1900-01-19"},{"$f":"IF(AND(YEAR(NovOffset+15)=CalendarYear,MONTH(NovOffset+15)=11),DAY(NovOffset+15),\"\")","v":"1900-01-12"},{"$f":"IF(AND(YEAR(NovOffset+16)=CalendarYear,MONTH(NovOffset+16)=11),DAY(NovOffset+16),\"\")","v":"1900-01-13"},{"$f":"IF(AND(YEAR(NovOffset+17)=CalendarYear,MONTH(NovOffset+17)=11),DAY(NovOffset+17),\"\")","v":"1900-01-14"},{"$f":"IF(AND(YEAR(NovOffset+18)=CalendarYear,MONTH(NovOffset+18)=11),DAY(NovOffset+18),\"\")","v":"1900-01-15"},{"$f":"IF(AND(YEAR(NovOffset+19)=CalendarYear,MONTH(NovOffset+19)=11),DAY(NovOffset+19),\"\")","v":"1900-01-16"},{"$f":"IF(AND(YEAR(NovOffset+20)=CalendarYear,MONTH(NovOffset+20)=11),DAY(NovOffset+20),\"\")","v":"1900-01-17"},{"$f":"IF(AND(YEAR(NovOffset+21)=CalendarYear,MONTH(NovOffset+21)=11),DAY(NovOffset+21),\"\")","v":"1900-01-18"}]
[{"$f":"INDEX('Irrig Sched'!$J$9:$J$37,MATCH(A23,'Irrig Sched'!$G$9:$G$37,0))","v":""},{"$f":"INDEX('Irrig Sched'!$J$9:$J$37,MATCH(B23,'Irrig Sched'!$G$9:$G$37,0))","v":""},{"$f":"INDEX('Irrig Sched'!$J$9:$J$37,MATCH(C23,'Irrig Sched'!$G$9:$G$37,0))","v":""},{"$f":"INDEX('Irrig Sched'!$J$9:$J$37,MATCH(D23,'Irrig Sched'!$G$9:$G$37,0))","v":""},{"$f":"INDEX('Irrig Sched'!$J$9:$J$37,MATCH(E23,'Irrig Sched'!$G$9:$G$37,0))","v":""},{"$f":"INDEX('Irrig Sched'!$J$9:$J$37,MATCH(F23,'Irrig Sched'!$G$9:$G$37,0))","v":""},{"$f":"INDEX('Irrig Sched'!$J$9:$J$37,MATCH(G23,'Irrig Sched'!$G$9:$G$37,0))","v":""},{"$f":"INDEX('Irrig Sched'!$Y$9:$Y$39,MATCH(H23,'Irrig Sched'!$V$9:$V$39,0))","v":""},{"$f":"INDEX('Irrig Sched'!$Y$9:$Y$39,MATCH(I23,'Irrig Sched'!$V$9:$V$39,0))","v":""},{"$f":"INDEX('Irrig Sched'!$Y$9:$Y$39,MATCH(J23,'Irrig Sched'!$V$9:$V$39,0))","v":"Run"},{"$f":"INDEX('Irrig Sched'!$Y$9:$Y$39,MATCH(K23,'Irrig Sched'!$V$9:$V$39,0))","v":""},{"$f":"INDEX('Irrig Sched'!$Y$9:$Y$39,MATCH(L23,'Irrig Sched'!$V$9:$V$39,0))","v":""},{"$f":"INDEX('Irrig Sched'!$Y$9:$Y$39,MATCH(M23,'Irrig Sched'!$V$9:$V$39,0))","v":""},{"$f":"INDEX('Irrig Sched'!$Y$9:$Y$39,MATCH(N23,'Irrig Sched'!$V$9:$V$39,0))","v":""},{"$f":"INDEX('Irrig Sched'!$AN$9:$AN$39,MATCH(O23,'Irrig Sched'!$AK$9:$AK$39,0))","v":""},{"$f":"INDEX('Irrig Sched'!$AN$9:$AN$39,MATCH(P23,'Irrig Sched'!$AK$9:$AK$39,0))","v":""},{"$f":"INDEX('Irrig Sched'!$AN$9:$AN$39,MATCH(Q23,'Irrig Sched'!$AK$9:$AK$39,0))","v":""},{"$f":"INDEX('Irrig Sched'!$AN$9:$AN$39,MATCH(R23,'Irrig Sched'!$AK$9:$AK$39,0))","v":""},{"$f":"INDEX('Irrig Sched'!$AN$9:$AN$39,MATCH(S23,'Irrig Sched'!$AK$9:$AK$39,0))","v":"Run"},{"$f":"INDEX('Irrig Sched'!$AN$9:$AN$39,MATCH(T23,'Irrig Sched'!$AK$9:$AK$39,0))","v":""},{"$f":"INDEX('Irrig Sched'!$AN$9:$AN$39,MATCH(U23,'Irrig Sched'!$AK$9:$AK$39,0))","v":""},{"$f":"INDEX('Irrig Sched'!$BC$9:$BC$39,MATCH(V23,'Irrig Sched'!$AZ$9:$AZ$39,0))","v":""},{"$f":"INDEX('Irrig Sched'!$BC$9:$BC$39,MATCH(W23,'Irrig Sched'!$AZ$9:$AZ$39,0))","v":""},{"$f":"INDEX('Irrig Sched'!$BC$9:$BC$39,MATCH(X23,'Irrig Sched'!$AZ$9:$AZ$39,0))","v":""},{"$f":"INDEX('Irrig Sched'!$BC$9:$BC$39,MATCH(Y23,'Irrig Sched'!$AZ$9:$AZ$39,0))","v":""},{"$f":"INDEX('Irrig Sched'!$BC$9:$BC$39,MATCH(Z23,'Irrig Sched'!$AZ$9:$AZ$39,0))","v":""},{"$f":"INDEX('Irrig Sched'!$BC$9:$BC$39,MATCH(AA23,'Irrig Sched'!$AZ$9:$AZ$39,0))","v":""},{"$f":"INDEX('Irrig Sched'!$BC$9:$BC$39,MATCH(AB23,'Irrig Sched'!$AZ$9:$AZ$39,0))","v":""}]
[{"$f":"IF(AND(YEAR(FebOffset+22)=CalendarYear,MONTH(FebOffset+22)=2),DAY(FebOffset+22),\"\")","v":"1900-01-19"},{"$f":"IF(AND(YEAR(FebOffset+23)=CalendarYear,MONTH(FebOffset+23)=2),DAY(FebOffset+23),\"\")","v":"1900-01-20"},{"$f":"IF(AND(YEAR(FebOffset+24)=CalendarYear,MONTH(FebOffset+24)=2),DAY(FebOffset+24),\"\")","v":"1900-01-21"},{"$f":"IF(AND(YEAR(FebOffset+25)=CalendarYear,MONTH(FebOffset+25)=2),DAY(FebOffset+25),\"\")","v":"1900-01-22"},{"$f":"IF(AND(YEAR(FebOffset+26)=CalendarYear,MONTH(FebOffset+26)=2),DAY(FebOffset+26),\"\")","v":"1900-01-23"},{"$f":"IF(AND(YEAR(FebOffset+27)=CalendarYear,MONTH(FebOffset+27)=2),DAY(FebOffset+27),\"\")","v":"1900-01-24"},{"$f":"IF(AND(YEAR(FebOffset+28)=CalendarYear,MONTH(FebOffset+28)=2),DAY(FebOffset+28),\"\")","v":"1900-01-25"},{"$f":"IF(AND(YEAR(MayOffset+22)=CalendarYear,MONTH(MayOffset+22)=5),DAY(MayOffset+22),\"\")","v":"1900-01-21"},{"$f":"IF(AND(YEAR(MayOffset+23)=CalendarYear,MONTH(MayOffset+23)=5),DAY(MayOffset+23),\"\")","v":"1900-01-22"},{"$f":"IF(AND(YEAR(MayOffset+24)=CalendarYear,MONTH(MayOffset+24)=5),DAY(MayOffset+24),\"\")","v":"1900-01-23"},{"$f":"IF(AND(YEAR(MayOffset+25)=CalendarYear,MONTH(MayOffset+25)=5),DAY(MayOffset+25),\"\")","v":"1900-01-24"},{"$f":"IF(AND(YEAR(MayOffset+26)=CalendarYear,MONTH(MayOffset+26)=5),DAY(MayOffset+26),\"\")","v":"1900-01-25"},{"$f":"IF(AND(YEAR(MayOffset+27)=CalendarYear,MONTH(MayOffset+27)=5),DAY(MayOffset+27),\"\")","v":"1900-01-26"},{"$f":"IF(AND(YEAR(MayOffset+28)=CalendarYear,MONTH(MayOffset+28)=5),DAY(MayOffset+28),\"\")","v":"1900-01-27"},{"$f":"IF(AND(YEAR(AugOffset+22)=CalendarYear,MONTH(AugOffset+22)=8),DAY(AugOffset+22),\"\")","v":"1900-01-20"},{"$f":"IF(AND(YEAR(AugOffset+23)=CalendarYear,MONTH(AugOffset+23)=8),DAY(AugOffset+23),\"\")","v":"1900-01-21"},{"$f":"IF(AND(YEAR(AugOffset+24)=CalendarYear,MONTH(AugOffset+24)=8),DAY(AugOffset+24),\"\")","v":"1900-01-22"},{"$f":"IF(AND(YEAR(AugOffset+25)=CalendarYear,MONTH(AugOffset+25)=8),DAY(AugOffset+25),\"\")","v":"1900-01-23"},{"$f":"IF(AND(YEAR(AugOffset+26)=CalendarYear,MONTH(AugOffset+26)=8),DAY(AugOffset+26),\"\")","v":"1900-01-24"},{"$f":"IF(AND(YEAR(AugOffset+27)=CalendarYear,MONTH(AugOffset+27)=8),DAY(AugOffset+27),\"\")","v":"1900-01-25"},{"$f":"IF(AND(YEAR(AugOffset+28)=CalendarYear,MONTH(AugOffset+28)=8),DAY(AugOffset+28),\"\")","v":"1900-01-26"},{"$f":"IF(AND(YEAR(NovOffset+22)=CalendarYear,MONTH(NovOffset+22)=11),DAY(NovOffset+22),\"\")","v":"1900-01-19"},{"$f":"IF(AND(YEAR(NovOffset+23)=CalendarYear,MONTH(NovOffset+23)=11),DAY(NovOffset+23),\"\")","v":"1900-01-20"},{"$f":"IF(AND(YEAR(NovOffset+24)=CalendarYear,MONTH(NovOffset+24)=11),DAY(NovOffset+24),\"\")","v":"1900-01-21"},{"$f":"IF(AND(YEAR(NovOffset+25)=CalendarYear,MONTH(NovOffset+25)=11),DAY(NovOffset+25),\"\")","v":"1900-01-22"},{"$f":"IF(AND(YEAR(NovOffset+26)=CalendarYear,MONTH(NovOffset+26)=11),DAY(NovOffset+26),\"\")","v":"1900-01-23"},{"$f":"IF(AND(YEAR(NovOffset+27)=CalendarYear,MONTH(NovOffset+27)=11),DAY(NovOffset+27),\"\")","v":"1900-01-24"},{"$f":"IF(AND(YEAR(NovOffset+28)=CalendarYear,MONTH(NovOffset+28)=11),DAY(NovOffset+28),\"\")","v":"1900-01-25"}]
[{"$f":"INDEX('Irrig Sched'!$J$9:$J$37,MATCH(A25,'Irrig Sched'!$G$9:$G$37,0))","v":""},{"$f":"INDEX('Irrig Sched'!$J$9:$J$37,MATCH(B25,'Irrig Sched'!$G$9:$G$37,0))","v":""},{"$f":"INDEX('Irrig Sched'!$J$9:$J$37,MATCH(C25,'Irrig Sched'!$G$9:$G$37,0))","v":"Run"},{"$f":"INDEX('Irrig Sched'!$J$9:$J$37,MATCH(D25,'Irrig Sched'!$G$9:$G$37,0))","v":""},{"$f":"INDEX('Irrig Sched'!$J$9:$J$37,MATCH(E25,'Irrig Sched'!$G$9:$G$37,0))","v":""},{"$f":"INDEX('Irrig Sched'!$J$9:$J$37,MATCH(F25,'Irrig Sched'!$G$9:$G$37,0))","v":""},{"$f":"INDEX('Irrig Sched'!$J$9:$J$37,MATCH(G25,'Irrig Sched'!$G$9:$G$37,0))","v":""},{"$f":"INDEX('Irrig Sched'!$Y$9:$Y$39,MATCH(H25,'Irrig Sched'!$V$9:$V$39,0))","v":""},{"$f":"INDEX('Irrig Sched'!$Y$9:$Y$39,MATCH(I25,'Irrig Sched'!$V$9:$V$39,0))","v":""},{"$f":"INDEX('Irrig Sched'!$Y$9:$Y$39,MATCH(J25,'Irrig Sched'!$V$9:$V$39,0))","v":"Run"},{"$f":"INDEX('Irrig Sched'!$Y$9:$Y$39,MATCH(K25,'Irrig Sched'!$V$9:$V$39,0))","v":""},{"$f":"INDEX('Irrig Sched'!$Y$9:$Y$39,MATCH(L25,'Irrig Sched'!$V$9:$V$39,0))","v":""},{"$f":"INDEX('Irrig Sched'!$Y$9:$Y$39,MATCH(M25,'Irrig Sched'!$V$9:$V$39,0))","v":""},{"$f":"INDEX('Irrig Sched'!$Y$9:$Y$39,MATCH(N25,'Irrig Sched'!$V$9:$V$39,0))","v":"Run"},{"$f":"INDEX('Irrig Sched'!$AN$9:$AN$39,MATCH(O25,'Irrig Sched'!$AK$9:$AK$39,0))","v":""},{"$f":"INDEX('Irrig Sched'!$AN$9:$AN$39,MATCH(P25,'Irrig Sched'!$AK$9:$AK$39,0))","v":""},{"$f":"INDEX('Irrig Sched'!$AN$9:$AN$39,MATCH(Q25,'Irrig Sched'!$AK$9:$AK$39,0))","v":"Run"},{"$f":"INDEX('Irrig Sched'!$AN$9:$AN$39,MATCH(R25,'Irrig Sched'!$AK$9:$AK$39,0))","v":""},{"$f":"INDEX('Irrig Sched'!$AN$9:$AN$39,MATCH(S25,'Irrig Sched'!$AK$9:$AK$39,0))","v":""},{"$f":"INDEX('Irrig Sched'!$AN$9:$AN$39,MATCH(T25,'Irrig Sched'!$AK$9:$AK$39,0))","v":""},{"$f":"INDEX('Irrig Sched'!$AN$9:$AN$39,MATCH(U25,'Irrig Sched'!$AK$9:$AK$39,0))","v":"Run"},{"$f":"INDEX('Irrig Sched'!$BC$9:$BC$39,MATCH(V25,'Irrig Sched'!$AZ$9:$AZ$39,0))","v":""},{"$f":"INDEX('Irrig Sched'!$BC$9:$BC$39,MATCH(W25,'Irrig Sched'!$AZ$9:$AZ$39,0))","v":""},{"$f":"INDEX('Irrig Sched'!$BC$9:$BC$39,MATCH(X25,'Irrig Sched'!$AZ$9:$AZ$39,0))","v":""},{"$f":"INDEX('Irrig Sched'!$BC$9:$BC$39,MATCH(Y25,'Irrig Sched'!$AZ$9:$AZ$39,0))","v":""},{"$f":"INDEX('Irrig Sched'!$BC$9:$BC$39,MATCH(Z25,'Irrig Sched'!$AZ$9:$AZ$39,0))","v":"Run"},{"$f":"INDEX('Irrig Sched'!$BC$9:$BC$39,MATCH(AA25,'Irrig Sched'!$AZ$9:$AZ$39,0))","v":""},{"$f":"INDEX('Irrig Sched'!$BC$9:$BC$39,MATCH(AB25,'Irrig Sched'!$AZ$9:$AZ$39,0))","v":""}]
[{"$f":"IF(AND(YEAR(FebOffset+29)=CalendarYear,MONTH(FebOffset+29)=2),DAY(FebOffset+29),\"\")","v":"1900-01-26"},{"$f":"IF(AND(YEAR(FebOffset+30)=CalendarYear,MONTH(FebOffset+30)=2),DAY(FebOffset+30),\"\")","v":"1900-01-27"},null,null,null,null,null,{"$f":"IF(AND(YEAR(MayOffset+29)=CalendarYear,MONTH(MayOffset+29)=5),DAY(MayOffset+29),\"\")","v":"1900-01-28"},{"$f":"IF(AND(YEAR(MayOffset+30)=CalendarYear,MONTH(MayOffset+30)=5),DAY(MayOffset+30),\"\")","v":"1900-01-29"},{"$f":"IF(AND(YEAR(MayOffset+31)=CalendarYear,MONTH(MayOffset+31)=5),DAY(MayOffset+31),\"\")","v":"1900-01-30"},{"$f":"IF(AND(YEAR(MayOffset+32)=CalendarYear,MONTH(MayOffset+32)=5),DAY(MayOffset+32),\"\")","v":"1900-01-31"},{"$f":"IF(AND(YEAR(MayOffset+33)=CalendarYear,MONTH(MayOffset+33)=5),DAY(MayOffset+33),\"\")","v":""},{"$f":"IF(AND(YEAR(MayOffset+34)=CalendarYear,MONTH(MayOffset+34)=5),DAY(MayOffset+34),\"\")","v":""},{"$f":"IF(AND(YEAR(MayOffset+35)=CalendarYear,MONTH(MayOffset+35)=5),DAY(MayOffset+35),\"\")","v":""},{"$f":"IF(AND(YEAR(AugOffset+29)=CalendarYear,MONTH(AugOffset+29)=8),DAY(AugOffset+29),\"\")","v":"1900-01-27"},{"$f":"IF(AND(YEAR(AugOffset+30)=CalendarYear,MONTH(AugOffset+30)=8),DAY(AugOffset+30),\"\")","v":"1900-01-28"},{"$f":"IF(AND(YEAR(AugOffset+31)=CalendarYear,MONTH(AugOffset+31)=8),DAY(AugOffset+31),\"\")","v":"1900-01-29"},{"$f":"IF(AND(YEAR(AugOffset+32)=CalendarYear,MONTH(AugOffset+32)=8),DAY(AugOffset+32),\"\")","v":"1900-01-30"},{"$f":"IF(AND(YEAR(AugOffset+33)=CalendarYear,MONTH(AugOffset+33)=8),DAY(AugOffset+33),\"\")","v":"1900-01-31"},{"$f":"IF(AND(YEAR(AugOffset+34)=CalendarYear,MONTH(AugOffset+34)=8),DAY(AugOffset+34),\"\")","v":""},{"$f":"IF(AND(YEAR(AugOffset+35)=CalendarYear,MONTH(AugOffset+35)=8),DAY(AugOffset+35),\"\")","v":""},{"$f":"IF(AND(YEAR(NovOffset+29)=CalendarYear,MONTH(NovOffset+29)=11),DAY(NovOffset+29),\"\")","v":"1900-01-26"},{"$f":"IF(AND(YEAR(NovOffset+30)=CalendarYear,MONTH(NovOffset+30)=11),DAY(NovOffset+30),\"\")","v":"1900-01-27"},{"$f":"IF(AND(YEAR(NovOffset+31)=CalendarYear,MONTH(NovOffset+31)=11),DAY(NovOffset+31),\"\")","v":"1900-01-28"},{"$f":"IF(AND(YEAR(NovOffset+32)=CalendarYear,MONTH(NovOffset+32)=11),DAY(NovOffset+32),\"\")","v":"1900-01-29"},{"$f":"IF(AND(YEAR(NovOffset+33)=CalendarYear,MONTH(NovOffset+33)=11),DAY(NovOffset+33),\"\")","v":"1900-01-30"},{"$f":"IF(AND(YEAR(NovOffset+34)=CalendarYear,MONTH(NovOffset+34)=11),DAY(NovOffset+34),\"\")","v":""},{"$f":"IF(AND(YEAR(NovOffset+35)=CalendarYear,MONTH(NovOffset+35)=11),DAY(NovOffset+35),\"\")","v":""}]
[{"$f":"IF(A27=\"\",\"\",INDEX('Irrig Sched'!$J$9:$J$37,MATCH(A27,'Irrig Sched'!$G$9:$G$37,0)))","v":""},{"$f":"IF(B27=\"\",\"\",INDEX('Irrig Sched'!$J$9:$J$37,MATCH(B27,'Irrig Sched'!$G$9:$G$37,0)))","v":""},null,null,null,null,null,{"$f":"IF(H27=\"\",\"\",INDEX('Irrig Sched'!$Y$9:$Y$39,MATCH(H27,'Irrig Sched'!$V$9:$V$39,0)))","v":""},{"$f":"IF(I27=\"\",\"\",INDEX('Irrig Sched'!$Y$9:$Y$39,MATCH(I27,'Irrig Sched'!$V$9:$V$39,0)))","v":""},{"$f":"IF(J27=\"\",\"\",INDEX('Irrig Sched'!$Y$9:$Y$39,MATCH(J27,'Irrig Sched'!$V$9:$V$39,0)))","v":""},{"$f":"IF(K27=\"\",\"\",INDEX('Irrig Sched'!$Y$9:$Y$39,MATCH(K27,'Irrig Sched'!$V$9:$V$39,0)))","v":""},{"$f":"IF(L27=\"\",\"\",INDEX('Irrig Sched'!$Y$9:$Y$39,MATCH(L27,'Irrig Sched'!$V$9:$V$39,0)))","v":""},{"$f":"IF(M27=\"\",\"\",INDEX('Irrig Sched'!$Y$9:$Y$39,MATCH(M27,'Irrig Sched'!$V$9:$V$39,0)))","v":""},{"$f":"IF(N27=\"\",\"\",INDEX('Irrig Sched'!$Y$9:$Y$39,MATCH(N27,'Irrig Sched'!$V$9:$V$39,0)))","v":""},{"$f":"IF(O27=\"\",\"\",INDEX('Irrig Sched'!$AN$9:$AN$39,MATCH(O27,'Irrig Sched'!$AK$9:$AK$39,0)))","v":""},{"$f":"IF(P27=\"\",\"\",INDEX('Irrig Sched'!$AN$9:$AN$39,MATCH(P27,'Irrig Sched'!$AK$9:$AK$39,0)))","v":""},{"$f":"IF(Q27=\"\",\"\",INDEX('Irrig Sched'!$AN$9:$AN$39,MATCH(Q27,'Irrig Sched'!$AK$9:$AK$39,0)))","v":"Run"},{"$f":"IF(R27=\"\",\"\",INDEX('Irrig Sched'!$AN$9:$AN$39,MATCH(R27,'Irrig Sched'!$AK$9:$AK$39,0)))","v":""},{"$f":"IF(S27=\"\",\"\",INDEX('Irrig Sched'!$AN$9:$AN$39,MATCH(S27,'Irrig Sched'!$AK$9:$AK$39,0)))","v":""},{"$f":"IF(T27=\"\",\"\",INDEX('Irrig Sched'!$AN$9:$AN$39,MATCH(T27,'Irrig Sched'!$AK$9:$AK$39,0)))","v":""},{"$f":"IF(U27=\"\",\"\",INDEX('Irrig Sched'!$AN$9:$AN$39,MATCH(U27,'Irrig Sched'!$AK$9:$AK$39,0)))","v":""},{"$f":"IF(V27=\"\",\"\",INDEX('Irrig Sched'!$BC$9:$BC$39,MATCH(V27,'Irrig Sched'!$AZ$9:$AZ$39,0)))","v":""},{"$f":"IF(W27=\"\",\"\",INDEX('Irrig Sched'!$BC$9:$BC$39,MATCH(W27,'Irrig Sched'!$AZ$9:$AZ$39,0)))","v":""},{"$f":"IF(X27=\"\",\"\",INDEX('Irrig Sched'!$BC$9:$BC$39,MATCH(X27,'Irrig Sched'!$AZ$9:$AZ$39,0)))","v":""},{"$f":"IF(Y27=\"\",\"\",INDEX('Irrig Sched'!$BC$9:$BC$39,MATCH(Y27,'Irrig Sched'!$AZ$9:$AZ$39,0)))","v":""},{"$f":"IF(Z27=\"\",\"\",INDEX('Irrig Sched'!$BC$9:$BC$39,MATCH(Z27,'Irrig Sched'!$AZ$9:$AZ$39,0)))","v":""},{"$f":"IF(AA27=\"\",\"\",INDEX('Irrig Sched'!$BC$9:$BC$39,MATCH(AA27,'Irrig Sched'!$AZ$9:$AZ$39,0)))","v":""},{"$f":"IF(AB27=\"\",\"\",INDEX('Irrig Sched'!$BC$9:$BC$39,MATCH(AB27,'Irrig Sched'!$AZ$9:$AZ$39,0)))","v":""}]
[null,null,null,null,null,null,null,{"$f":"IF(AND(YEAR(MayOffset+36)=CalendarYear,MONTH(MayOffset+36)=5),DAY(MayOffset+36),\"\")","v":""},{"$f":"IF(AND(YEAR(MayOffset+37)=CalendarYear,MONTH(MayOffset+37)=5),DAY(MayOffset+37),\"\")","v":""},null,null,null,null,null,{"$f":"IF(AND(YEAR(AugOffset+36)=CalendarYear,MONTH(AugOffset+36)=8),DAY(AugOffset+36),\"\")","v":""},{"$f":"IF(AND(YEAR(AugOffset+37)=CalendarYear,MONTH(AugOffset+37)=8),DAY(AugOffset+37),\"\")","v":""},null,null,null,null,null,{"$f":"IF(AND(YEAR(NovOffset+36)=CalendarYear,MONTH(NovOffset+36)=11),DAY(NovOffset+36),\"\")","v":""},{"$f":"IF(AND(YEAR(NovOffset+37)=CalendarYear,MONTH(NovOffset+37)=11),DAY(NovOffset+37),\"\")","v":""}]
[null,null,null,null,null,null,null,{"$f":"IF(H29=\"\",\"\",INDEX('Irrig Sched'!$Y$9:$Y$39,MATCH(H29,'Irrig Sched'!$V$9:$V$39,0)))","v":""},{"$f":"IF(I29=\"\",\"\",INDEX('Irrig Sched'!$Y$9:$Y$39,MATCH(I29,'Irrig Sched'!$V$9:$V$39,0)))","v":""},null,null,null,null,null,{"$f":"IF(O29=\"\",\"\",INDEX('Irrig Sched'!$AN$9:$AN$39,MATCH(O29,'Irrig Sched'!$AK$9:$AK$39,0)))","v":""},{"$f":"IF(P29=\"\",\"\",INDEX('Irrig Sched'!$AN$9:$AN$39,MATCH(P29,'Irrig Sched'!$AK$9:$AK$39,0)))","v":""},null,null,null,null,null,{"$f":"IF(V29=\"\",\"\",INDEX('Irrig Sched'!$BC$9:$BC$39,MATCH(V29,'Irrig Sched'!$AZ$9:$AZ$39,0)))","v":""},{"$f":"IF(W29=\"\",\"\",INDEX('Irrig Sched'!$BC$9:$BC$39,MATCH(W29,'Irrig Sched'!$AZ$9:$AZ$39,0)))","v":""}]
[]
[{"$f":"CONCATENATE(\"March \",Irrig_Year)","v":"March 2017"},null,null,null,null,null,null,{"$f":"CONCATENATE(\"June \",Irrig_Year)","v":"June 2017"},null,null,null,null,null,null,{"$f":"CONCATENATE(\"September \",Irrig_Year)","v":"September 2017"},null,null,null,null,null,null,{"$f":"CONCATENATE(\"December \",Irrig_Year)","v":"December 2017"}]
["SUNDAY","MONDAY","TUESDAY","WEDNESDAY","THURSDAY","FRIDAY","SATURDAY","SUNDAY","MONDAY","TUESDAY","WEDNESDAY","THURSDAY","FRIDAY","SATURDAY","SUNDAY","MONDAY","TUESDAY","WEDNESDAY","THURSDAY","FRIDAY","SATURDAY","SUNDAY","MONDAY","TUESDAY","WEDNESDAY","THURSDAY","FRIDAY","SATURDAY"]
[{"$f":"IF(AND(YEAR(MarOffset+1)=CalendarYear,MONTH(MarOffset+1)=3),DAY(MarOffset+1),\"\")","v":""},{"$f":"IF(AND(YEAR(MarOffset+2)=CalendarYear,MONTH(MarOffset+2)=3),DAY(MarOffset+2),\"\")","v":""},{"$f":"IF(AND(YEAR(MarOffset+3)=CalendarYear,MONTH(MarOffset+3)=3),DAY(MarOffset+3),\"\")","v":""},{"$f":"IF(AND(YEAR(MarOffset+4)=CalendarYear,MONTH(MarOffset+4)=3),DAY(MarOffset+4),\"\")","v":"1900-01-01"},{"$f":"IF(AND(YEAR(MarOffset+5)=CalendarYear,MONTH(MarOffset+5)=3),DAY(MarOffset+5),\"\")","v":"1900-01-02"},{"$f":"IF(AND(YEAR(MarOffset+6)=CalendarYear,MONTH(MarOffset+6)=3),DAY(MarOffset+6),\"\")","v":"1900-01-03"},{"$f":"IF(AND(YEAR(MarOffset+7)=CalendarYear,MONTH(MarOffset+7)=3),DAY(MarOffset+7),\"\")","v":"1900-01-04"},{"$f":"IF(AND(YEAR(JunOffset+1)=CalendarYear,MONTH(JunOffset+1)=6),DAY(JunOffset+1),\"\")","v":""},{"$f":"IF(AND(YEAR(JunOffset+2)=CalendarYear,MONTH(JunOffset+2)=6),DAY(JunOffset+2),\"\")","v":""},{"$f":"IF(AND(YEAR(JunOffset+3)=CalendarYear,MONTH(JunOffset+3)=6),DAY(JunOffset+3),\"\")","v":""},{"$f":"IF(AND(YEAR(JunOffset+4)=CalendarYear,MONTH(JunOffset+4)=6),DAY(JunOffset+4),\"\")","v":""},{"$f":"IF(AND(YEAR(JunOffset+5)=CalendarYear,MONTH(JunOffset+5)=6),DAY(JunOffset+5),\"\")","v":"1900-01-01"},{"$f":"IF(AND(YEAR(JunOffset+6)=CalendarYear,MONTH(JunOffset+6)=6),DAY(JunOffset+6),\"\")","v":"1900-01-02"},{"$f":"IF(AND(YEAR(JunOffset+7)=CalendarYear,MONTH(JunOffset+7)=6),DAY(JunOffset+7),\"\")","v":"1900-01-03"},{"$f":"IF(AND(YEAR(SepOffset+1)=CalendarYear,MONTH(SepOffset+1)=9),DAY(SepOffset+1),\"\")","v":""},{"$f":"IF(AND(YEAR(SepOffset+2)=CalendarYear,MONTH(SepOffset+2)=9),DAY(SepOffset+2),\"\")","v":""},{"$f":"IF(AND(YEAR(SepOffset+3)=CalendarYear,MONTH(SepOffset+3)=9),DAY(SepOffset+3),\"\")","v":""},{"$f":"IF(AND(YEAR(SepOffset+1)=CalendarYear,MONTH(SepOffset+4)=9),DAY(SepOffset+4),\"\")","v":""},{"$f":"IF(AND(YEAR(SepOffset+5)=CalendarYear,MONTH(SepOffset+5)=9),DAY(SepOffset+5),\"\")","v":""},{"$f":"IF(AND(YEAR(SepOffset+1)=CalendarYear,MONTH(SepOffset+6)=9),DAY(SepOffset+6),\"\")","v":"1900-01-01"},{"$f":"IF(AND(YEAR(SepOffset+7)=CalendarYear,MONTH(SepOffset+7)=9),DAY(SepOffset+7),\"\")","v":"1900-01-02"},{"$f":"IF(AND(YEAR(DecOffset+1)=CalendarYear,MONTH(DecOffset+1)=12),DAY(DecOffset+1),\"\")","v":""},{"$f":"IF(AND(YEAR(DecOffset+2)=CalendarYear,MONTH(DecOffset+2)=12),DAY(DecOffset+2),\"\")","v":""},{"$f":"IF(AND(YEAR(DecOffset+3)=CalendarYear,MONTH(DecOffset+3)=12),DAY(DecOffset+3),\"\")","v":""},{"$f":"IF(AND(YEAR(DecOffset+4)=CalendarYear,MONTH(DecOffset+4)=12),DAY(DecOffset+4),\"\")","v":""},{"$f":"IF(AND(YEAR(DecOffset+5)=CalendarYear,MONTH(DecOffset+5)=12),DAY(DecOffset+5),\"\")","v":""},{"$f":"IF(AND(YEAR(DecOffset+6)=CalendarYear,MONTH(DecOffset+6)=12),DAY(DecOffset+6),\"\")","v":"1900-01-01"},{"$f":"IF(AND(YEAR(DecOffset+7)=CalendarYear,MONTH(DecOffset+7)=12),DAY(DecOffset+7),\"\")","v":"1900-01-02"}]
[{"$f":"IF(A34=\"\",\"\",INDEX('Irrig Sched'!$O$9:$O$39,MATCH(A34,'Irrig Sched'!$L$9:$L$39,0)))","v":""},{"$f":"IF(B34=\"\",\"\",INDEX('Irrig Sched'!$O$9:$O$39,MATCH(B34,'Irrig Sched'!$L$9:$L$39,0)))","v":""},{"$f":"IF(C34=\"\",\"\",INDEX('Irrig Sched'!$O$9:$O$39,MATCH(C34,'Irrig Sched'!$L$9:$L$39,0)))","v":""},{"$f":"IF(D34=\"\",\"\",INDEX('Irrig Sched'!$O$9:$O$39,MATCH(D34,'Irrig Sched'!$L$9:$L$39,0)))","v":""},{"$f":"IF(E34=\"\",\"\",INDEX('Irrig Sched'!$O$9:$O$39,MATCH(E34,'Irrig Sched'!$L$9:$L$39,0)))","v":""},{"$f":"IF(F34=\"\",\"\",INDEX('Irrig Sched'!$O$9:$O$39,MATCH(F34,'Irrig Sched'!$L$9:$L$39,0)))","v":""},{"$f":"IF(G34=\"\",\"\",INDEX('Irrig Sched'!$O$9:$O$39,MATCH(G34,'Irrig Sched'!$L$9:$L$39,0)))","v":""},{"$f":"IF(H34=\"\",\"\",INDEX('Irrig Sched'!$AD$9:$AD$39,MATCH(H34,'Irrig Sched'!$AA$9:$AA$39,0)))","v":""},{"$f":"IF(I34=\"\",\"\",INDEX('Irrig Sched'!$AD$9:$AD$39,MATCH(I34,'Irrig Sched'!$AA$9:$AA$39,0)))","v":""},{"$f":"IF(J34=\"\",\"\",INDEX('Irrig Sched'!$AD$9:$AD$39,MATCH(J34,'Irrig Sched'!$AA$9:$AA$39,0)))","v":""},{"$f":"IF(K34=\"\",\"\",INDEX('Irrig Sched'!$AD$9:$AD$39,MATCH(K34,'Irrig Sched'!$AA$9:$AA$39,0)))","v":""},{"$f":"IF(L34=\"\",\"\",INDEX('Irrig Sched'!$AD$9:$AD$39,MATCH(L34,'Irrig Sched'!$AA$9:$AA$39,0)))","v":"Run"},{"$f":"IF(M34=\"\",\"\",INDEX('Irrig Sched'!$AD$9:$AD$39,MATCH(M34,'Irrig Sched'!$AA$9:$AA$39,0)))","v":""},{"$f":"IF(N34=\"\",\"\",INDEX('Irrig Sched'!$AD$9:$AD$39,MATCH(N34,'Irrig Sched'!$AA$9:$AA$39,0)))","v":""},{"$f":"IF(O34=\"\",\"\",INDEX('Irrig Sched'!$AS$9:$AS$39,MATCH(O34,'Irrig Sched'!$AP$9:$AP$39,0)))","v":""},{"$f":"IF(P34=\"\",\"\",INDEX('Irrig Sched'!$AS$9:$AS$39,MATCH(P34,'Irrig Sched'!$AP$9:$AP$39,0)))","v":""},{"$f":"IF(Q34=\"\",\"\",INDEX('Irrig Sched'!$AS$9:$AS$39,MATCH(Q34,'Irrig Sched'!$AP$9:$AP$39,0)))","v":""},{"$f":"IF(R34=\"\",\"\",INDEX('Irrig Sched'!$AS$9:$AS$39,MATCH(R34,'Irrig Sched'!$AP$9:$AP$39,0)))","v":""},{"$f":"IF(S34=\"\",\"\",INDEX('Irrig Sched'!$AS$9:$AS$39,MATCH(S34,'Irrig Sched'!$AP$9:$AP$39,0)))","v":""},{"$f":"IF(T34=\"\",\"\",INDEX('Irrig Sched'!$AS$9:$AS$39,MATCH(T34,'Irrig Sched'!$AP$9:$AP$39,0)))","v":""},{"$f":"IF(U34=\"\",\"\",INDEX('Irrig Sched'!$AS$9:$AS$39,MATCH(U34,'Irrig Sched'!$AP$9:$AP$39,0)))","v":""},{"$f":"IF(V34=\"\",\"\",INDEX('Irrig Sched'!$BH$9:$BH$39,MATCH(V34,'Irrig Sched'!$BE$9:$BE$39,0)))","v":""},{"$f":"IF(W34=\"\",\"\",INDEX('Irrig Sched'!$BH$9:$BH$39,MATCH(W34,'Irrig Sched'!$BE$9:$BE$39,0)))","v":""},{"$f":"IF(X34=\"\",\"\",INDEX('Irrig Sched'!$BH$9:$BH$39,MATCH(X34,'Irrig Sched'!$BE$9:$BE$39,0)))","v":""},{"$f":"IF(Y34=\"\",\"\",INDEX('Irrig Sched'!$BH$9:$BH$39,MATCH(Y34,'Irrig Sched'!$BE$9:$BE$39,0)))","v":""},{"$f":"IF(Z34=\"\",\"\",INDEX('Irrig Sched'!$BH$9:$BH$39,MATCH(Z34,'Irrig Sched'!$BE$9:$BE$39,0)))","v":""},{"$f":"IF(AA34=\"\",\"\",INDEX('Irrig Sched'!$BH$9:$BH$39,MATCH(AA34,'Irrig Sched'!$BE$9:$BE$39,0)))","v":""},{"$f":"IF(AB34=\"\",\"\",INDEX('Irrig Sched'!$BH$9:$BH$39,MATCH(AB34,'Irrig Sched'!$BE$9:$BE$39,0)))","v":""}]
[{"$f":"IF(AND(YEAR(MarOffset+8)=CalendarYear,MONTH(MarOffset+8)=3),DAY(MarOffset+8),\"\")","v":"1900-01-05"},{"$f":"IF(AND(YEAR(MarOffset+9)=CalendarYear,MONTH(MarOffset+9)=3),DAY(MarOffset+9),\"\")","v":"1900-01-06"},{"$f":"IF(AND(YEAR(MarOffset+10)=CalendarYear,MONTH(MarOffset+10)=3),DAY(MarOffset+10),\"\")","v":"1900-01-07"},{"$f":"IF(AND(YEAR(MarOffset+11)=CalendarYear,MONTH(MarOffset+11)=3),DAY(MarOffset+11),\"\")","v":"1900-01-08"},{"$f":"IF(AND(YEAR(MarOffset+12)=CalendarYear,MONTH(MarOffset+12)=3),DAY(MarOffset+12),\"\")","v":"1900-01-09"},{"$f":"IF(AND(YEAR(MarOffset+13)=CalendarYear,MONTH(MarOffset+13)=3),DAY(MarOffset+13),\"\")","v":"1900-01-10"},{"$f":"IF(AND(YEAR(MarOffset+14)=CalendarYear,MONTH(MarOffset+14)=3),DAY(MarOffset+14),\"\")","v":"1900-01-11"},{"$f":"IF(AND(YEAR(JunOffset+8)=CalendarYear,MONTH(JunOffset+8)=6),DAY(JunOffset+8),\"\")","v":"1900-01-04"},{"$f":"IF(AND(YEAR(JunOffset+9)=CalendarYear,MONTH(JunOffset+9)=6),DAY(JunOffset+9),\"\")","v":"1900-01-05"},{"$f":"IF(AND(YEAR(JunOffset+10)=CalendarYear,MONTH(JunOffset+10)=6),DAY(JunOffset+10),\"\")","v":"1900-01-06"},{"$f":"IF(AND(YEAR(JunOffset+11)=CalendarYear,MONTH(JunOffset+11)=6),DAY(JunOffset+11),\"\")","v":"1900-01-07"},{"$f":"IF(AND(YEAR(JunOffset+12)=CalendarYear,MONTH(JunOffset+12)=6),DAY(JunOffset+12),\"\")","v":"1900-01-08"},{"$f":"IF(AND(YEAR(JunOffset+13)=CalendarYear,MONTH(JunOffset+13)=6),DAY(JunOffset+13),\"\")","v":"1900-01-09"},{"$f":"IF(AND(YEAR(JunOffset+14)=CalendarYear,MONTH(JunOffset+14)=6),DAY(JunOffset+14),\"\")","v":"1900-01-10"},{"$f":"IF(AND(YEAR(SepOffset+8)=CalendarYear,MONTH(SepOffset+8)=9),DAY(SepOffset+8),\"\")","v":"1900-01-03"},{"$f":"IF(AND(YEAR(SepOffset+9)=CalendarYear,MONTH(SepOffset+9)=9),DAY(SepOffset+9),\"\")","v":"1900-01-04"},{"$f":"IF(AND(YEAR(SepOffset+10)=CalendarYear,MONTH(SepOffset+10)=9),DAY(SepOffset+10),\"\")","v":"1900-01-05"},{"$f":"IF(AND(YEAR(SepOffset+11)=CalendarYear,MONTH(SepOffset+11)=9),DAY(SepOffset+11),\"\")","v":"1900-01-06"},{"$f":"IF(AND(YEAR(SepOffset+12)=CalendarYear,MONTH(SepOffset+12)=9),DAY(SepOffset+12),\"\")","v":"1900-01-07"},{"$f":"IF(AND(YEAR(SepOffset+13)=CalendarYear,MONTH(SepOffset+13)=9),DAY(SepOffset+13),\"\")","v":"1900-01-08"},{"$f":"IF(AND(YEAR(SepOffset+14)=CalendarYear,MONTH(SepOffset+14)=9),DAY(SepOffset+14),\"\")","v":"1900-01-09"},{"$f":"IF(AND(YEAR(DecOffset+8)=CalendarYear,MONTH(DecOffset+8)=12),DAY(DecOffset+8),\"\")","v":"1900-01-03"},{"$f":"IF(AND(YEAR(DecOffset+9)=CalendarYear,MONTH(DecOffset+9)=12),DAY(DecOffset+9),\"\")","v":"1900-01-04"},{"$f":"IF(AND(YEAR(DecOffset+10)=CalendarYear,MONTH(DecOffset+10)=12),DAY(DecOffset+10),\"\")","v":"1900-01-05"},{"$f":"IF(AND(YEAR(DecOffset+11)=CalendarYear,MONTH(DecOffset+11)=12),DAY(DecOffset+11),\"\")","v":"1900-01-06"},{"$f":"IF(AND(YEAR(DecOffset+12)=CalendarYear,MONTH(DecOffset+12)=12),DAY(DecOffset+12),\"\")","v":"1900-01-07"},{"$f":"IF(AND(YEAR(DecOffset+13)=CalendarYear,MONTH(DecOffset+13)=12),DAY(DecOffset+13),\"\")","v":"1900-01-08"},{"$f":"IF(AND(YEAR(DecOffset+14)=CalendarYear,MONTH(DecOffset+14)=12),DAY(DecOffset+14),\"\")","v":"1900-01-09"}]
[{"$f":"INDEX('Irrig Sched'!$O$9:$O$39,MATCH(A36,'Irrig Sched'!$L$9:$L$39,0))","v":""},{"$f":"INDEX('Irrig Sched'!$O$9:$O$39,MATCH(B36,'Irrig Sched'!$L$9:$L$39,0))","v":""},{"$f":"INDEX('Irrig Sched'!$O$9:$O$39,MATCH(C36,'Irrig Sched'!$L$9:$L$39,0))","v":"Run"},{"$f":"INDEX('Irrig Sched'!$O$9:$O$39,MATCH(D36,'Irrig Sched'!$L$9:$L$39,0))","v":""},{"$f":"INDEX('Irrig Sched'!$O$9:$O$39,MATCH(E36,'Irrig Sched'!$L$9:$L$39,0))","v":""},{"$f":"INDEX('Irrig Sched'!$O$9:$O$39,MATCH(F36,'Irrig Sched'!$L$9:$L$39,0))","v":""},{"$f":"INDEX('Irrig Sched'!$O$9:$O$39,MATCH(G36,'Irrig Sched'!$L$9:$L$39,0))","v":""},{"$f":"INDEX('Irrig Sched'!$AD$9:$AD$39,MATCH(H36,'Irrig Sched'!$AA$9:$AA$39,0))","v":""},{"$f":"INDEX('Irrig Sched'!$AD$9:$AD$39,MATCH(I36,'Irrig Sched'!$AA$9:$AA$39,0))","v":""},{"$f":"INDEX('Irrig Sched'!$AD$9:$AD$39,MATCH(J36,'Irrig Sched'!$AA$9:$AA$39,0))","v":"Run"},{"$f":"INDEX('Irrig Sched'!$AD$9:$AD$39,MATCH(K36,'Irrig Sched'!$AA$9:$AA$39,0))","v":""},{"$f":"INDEX('Irrig Sched'!$AD$9:$AD$39,MATCH(L36,'Irrig Sched'!$AA$9:$AA$39,0))","v":"Run"},{"$f":"INDEX('Irrig Sched'!$AD$9:$AD$39,MATCH(M36,'Irrig Sched'!$AA$9:$AA$39,0))","v":""},{"$f":"INDEX('Irrig Sched'!$AD$9:$AD$39,MATCH(N36,'Irrig Sched'!$AA$9:$AA$39,0))","v":""},{"$f":"INDEX('Irrig Sched'!$AS$9:$AS$39,MATCH(O36,'Irrig Sched'!$AP$9:$AP$39,0))","v":""},{"$f":"INDEX('Irrig Sched'!$AS$9:$AS$39,MATCH(P36,'Irrig Sched'!$AP$9:$AP$39,0))","v":""},{"$f":"INDEX('Irrig Sched'!$AS$9:$AS$39,MATCH(Q36,'Irrig Sched'!$AP$9:$AP$39,0))","v":"Run"},{"$f":"INDEX('Irrig Sched'!$AS$9:$AS$39,MATCH(R36,'Irrig Sched'!$AP$9:$AP$39,0))","v":""},{"$f":"INDEX('Irrig Sched'!$AS$9:$AS$39,MATCH(S36,'Irrig Sched'!$AP$9:$AP$39,0))","v":""},{"$f":"INDEX('Irrig Sched'!$AS$9:$AS$39,MATCH(T36,'Irrig Sched'!$AP$9:$AP$39,0))","v":""},{"$f":"INDEX('Irrig Sched'!$AS$9:$AS$39,MATCH(U36,'Irrig Sched'!$AP$9:$AP$39,0))","v":"Run"},{"$f":"INDEX('Irrig Sched'!$BH$9:$BH$39,MATCH(V36,'Irrig Sched'!$BE$9:$BE$39,0))","v":""},{"$f":"INDEX('Irrig Sched'!$BH$9:$BH$39,MATCH(W36,'Irrig Sched'!$BE$9:$BE$39,0))","v":""},{"$f":"INDEX('Irrig Sched'!$BH$9:$BH$39,MATCH(X36,'Irrig Sched'!$BE$9:$BE$39,0))","v":""},{"$f":"INDEX('Irrig Sched'!$BH$9:$BH$39,MATCH(Y36,'Irrig Sched'!$BE$9:$BE$39,0))","v":""},{"$f":"INDEX('Irrig Sched'!$BH$9:$BH$39,MATCH(Z36,'Irrig Sched'!$BE$9:$BE$39,0))","v":""},{"$f":"INDEX('Irrig Sched'!$BH$9:$BH$39,MATCH(AA36,'Irrig Sched'!$BE$9:$BE$39,0))","v":""},{"$f":"INDEX('Irrig Sched'!$BH$9:$BH$39,MATCH(AB36,'Irrig Sched'!$BE$9:$BE$39,0))","v":""}]
[{"$f":"IF(AND(YEAR(MarOffset+15)=CalendarYear,MONTH(MarOffset+15)=3),DAY(MarOffset+15),\"\")","v":"1900-01-12"},{"$f":"IF(AND(YEAR(MarOffset+16)=CalendarYear,MONTH(MarOffset+16)=3),DAY(MarOffset+16),\"\")","v":"1900-01-13"},{"$f":"IF(AND(YEAR(MarOffset+17)=CalendarYear,MONTH(MarOffset+17)=3),DAY(MarOffset+17),\"\")","v":"1900-01-14"},{"$f":"IF(AND(YEAR(MarOffset+18)=CalendarYear,MONTH(MarOffset+18)=3),DAY(MarOffset+18),\"\")","v":"1900-01-15"},{"$f":"IF(AND(YEAR(MarOffset+19)=CalendarYear,MONTH(MarOffset+19)=3),DAY(MarOffset+19),\"\")","v":"1900-01-16"},{"$f":"IF(AND(YEAR(MarOffset+20)=CalendarYear,MONTH(MarOffset+20)=3),DAY(MarOffset+20),\"\")","v":"1900-01-17"},{"$f":"IF(AND(YEAR(MarOffset+21)=CalendarYear,MONTH(MarOffset+21)=3),DAY(MarOffset+21),\"\")","v":"1900-01-18"},{"$f":"IF(AND(YEAR(JunOffset+15)=CalendarYear,MONTH(JunOffset+15)=6),DAY(JunOffset+15),\"\")","v":"1900-01-11"},{"$f":"IF(AND(YEAR(JunOffset+16)=CalendarYear,MONTH(JunOffset+16)=6),DAY(JunOffset+16),\"\")","v":"1900-01-12"},{"$f":"IF(AND(YEAR(JunOffset+17)=CalendarYear,MONTH(JunOffset+17)=6),DAY(JunOffset+17),\"\")","v":"1900-01-13"},{"$f":"IF(AND(YEAR(JunOffset+18)=CalendarYear,MONTH(JunOffset+18)=6),DAY(JunOffset+18),\"\")","v":"1900-01-14"},{"$f":"IF(AND(YEAR(JunOffset+19)=CalendarYear,MONTH(JunOffset+19)=6),DAY(JunOffset+19),\"\")","v":"1900-01-15"},{"$f":"IF(AND(YEAR(JunOffset+20)=CalendarYear,MONTH(JunOffset+20)=6),DAY(JunOffset+20),\"\")","v":"1900-01-16"},{"$f":"IF(AND(YEAR(JunOffset+21)=CalendarYear,MONTH(JunOffset+21)=6),DAY(JunOffset+21),\"\")","v":"1900-01-17"},{"$f":"IF(AND(YEAR(SepOffset+15)=CalendarYear,MONTH(SepOffset+15)=9),DAY(SepOffset+15),\"\")","v":"1900-01-10"},{"$f":"IF(AND(YEAR(SepOffset+16)=CalendarYear,MONTH(SepOffset+16)=9),DAY(SepOffset+16),\"\")","v":"1900-01-11"},{"$f":"IF(AND(YEAR(SepOffset+17)=CalendarYear,MONTH(SepOffset+17)=9),DAY(SepOffset+17),\"\")","v":"1900-01-12"},{"$f":"IF(AND(YEAR(SepOffset+18)=CalendarYear,MONTH(SepOffset+18)=9),DAY(SepOffset+18),\"\")","v":"1900-01-13"},{"$f":"IF(AND(YEAR(SepOffset+19)=CalendarYear,MONTH(SepOffset+19)=9),DAY(SepOffset+19),\"\")","v":"1900-01-14"},{"$f":"IF(AND(YEAR(SepOffset+20)=CalendarYear,MONTH(SepOffset+20)=9),DAY(SepOffset+20),\"\")","v":"1900-01-15"},{"$f":"IF(AND(YEAR(SepOffset+21)=CalendarYear,MONTH(SepOffset+21)=9),DAY(SepOffset+21),\"\")","v":"1900-01-16"},{"$f":"IF(AND(YEAR(DecOffset+15)=CalendarYear,MONTH(DecOffset+15)=12),DAY(DecOffset+15),\"\")","v":"1900-01-10"},{"$f":"IF(AND(YEAR(DecOffset+16)=CalendarYear,MONTH(DecOffset+16)=12),DAY(DecOffset+16),\"\")","v":"1900-01-11"},{"$f":"IF(AND(YEAR(DecOffset+17)=CalendarYear,MONTH(DecOffset+17)=12),DAY(DecOffset+17),\"\")","v":"1900-01-12"},{"$f":"IF(AND(YEAR(DecOffset+18)=CalendarYear,MONTH(DecOffset+18)=12),DAY(DecOffset+18),\"\")","v":"1900-01-13"},{"$f":"IF(AND(YEAR(DecOffset+19)=CalendarYear,MONTH(DecOffset+19)=12),DAY(DecOffset+19),\"\")","v":"1900-01-14"},{"$f":"IF(AND(YEAR(DecOffset+20)=CalendarYear,MONTH(DecOffset+20)=12),DAY(DecOffset+20),\"\")","v":"1900-01-15"},{"$f":"IF(AND(YEAR(DecOffset+21)=CalendarYear,MONTH(DecOffset+21)=12),DAY(DecOffset+21),\"\")","v":"1900-01-16"}]
[{"$f":"INDEX('Irrig Sched'!$O$9:$O$39,MATCH(A38,'Irrig Sched'!$L$9:$L$39,0))","v":""},{"$f":"INDEX('Irrig Sched'!$O$9:$O$39,MATCH(B38,'Irrig Sched'!$L$9:$L$39,0))","v":""},{"$f":"INDEX('Irrig Sched'!$O$9:$O$39,MATCH(C38,'Irrig Sched'!$L$9:$L$39,0))","v":"Run"},{"$f":"INDEX('Irrig Sched'!$O$9:$O$39,MATCH(D38,'Irrig Sched'!$L$9:$L$39,0))","v":""},{"$f":"INDEX('Irrig Sched'!$O$9:$O$39,MATCH(E38,'Irrig Sched'!$L$9:$L$39,0))","v":""},{"$f":"INDEX('Irrig Sched'!$O$9:$O$39,MATCH(F38,'Irrig Sched'!$L$9:$L$39,0))","v":""},{"$f":"INDEX('Irrig Sched'!$O$9:$O$39,MATCH(G38,'Irrig Sched'!$L$9:$L$39,0))","v":""},{"$f":"INDEX('Irrig Sched'!$AD$9:$AD$39,MATCH(H38,'Irrig Sched'!$AA$9:$AA$39,0))","v":""},{"$f":"INDEX('Irrig Sched'!$AD$9:$AD$39,MATCH(I38,'Irrig Sched'!$AA$9:$AA$39,0))","v":""},{"$f":"INDEX('Irrig Sched'!$AD$9:$AD$39,MATCH(J38,'Irrig Sched'!$AA$9:$AA$39,0))","v":"Run"},{"$f":"INDEX('Irrig Sched'!$AD$9:$AD$39,MATCH(K38,'Irrig Sched'!$AA$9:$AA$39,0))","v":""},{"$f":"INDEX('Irrig Sched'!$AD$9:$AD$39,MATCH(L38,'Irrig Sched'!$AA$9:$AA$39,0))","v":""},{"$f":"INDEX('Irrig Sched'!$AD$9:$AD$39,MATCH(M38,'Irrig Sched'!$AA$9:$AA$39,0))","v":""},{"$f":"INDEX('Irrig Sched'!$AD$9:$AD$39,MATCH(N38,'Irrig Sched'!$AA$9:$AA$39,0))","v":"Run"},{"$f":"INDEX('Irrig Sched'!$AS$9:$AS$39,MATCH(O38,'Irrig Sched'!$AP$9:$AP$39,0))","v":""},{"$f":"INDEX('Irrig Sched'!$AS$9:$AS$39,MATCH(P38,'Irrig Sched'!$AP$9:$AP$39,0))","v":""},{"$f":"INDEX('Irrig Sched'!$AS$9:$AS$39,MATCH(Q38,'Irrig Sched'!$AP$9:$AP$39,0))","v":""},{"$f":"INDEX('Irrig Sched'!$AS$9:$AS$39,MATCH(R38,'Irrig Sched'!$AP$9:$AP$39,0))","v":""},{"$f":"INDEX('Irrig Sched'!$AS$9:$AS$39,MATCH(S38,'Irrig Sched'!$AP$9:$AP$39,0))","v":"Run"},{"$f":"INDEX('Irrig Sched'!$AS$9:$AS$39,MATCH(T38,'Irrig Sched'!$AP$9:$AP$39,0))","v":""},{"$f":"INDEX('Irrig Sched'!$AS$9:$AS$39,MATCH(U38,'Irrig Sched'!$AP$9:$AP$39,0))","v":""},{"$f":"INDEX('Irrig Sched'!$BH$9:$BH$39,MATCH(V38,'Irrig Sched'!$BE$9:$BE$39,0))","v":""},{"$f":"INDEX('Irrig Sched'!$BH$9:$BH$39,MATCH(W38,'Irrig Sched'!$BE$9:$BE$39,0))","v":""},{"$f":"INDEX('Irrig Sched'!$BH$9:$BH$39,MATCH(X38,'Irrig Sched'!$BE$9:$BE$39,0))","v":""},{"$f":"INDEX('Irrig Sched'!$BH$9:$BH$39,MATCH(Y38,'Irrig Sched'!$BE$9:$BE$39,0))","v":""},{"$f":"INDEX('Irrig Sched'!$BH$9:$BH$39,MATCH(Z38,'Irrig Sched'!$BE$9:$BE$39,0))","v":""},{"$f":"INDEX('Irrig Sched'!$BH$9:$BH$39,MATCH(AA38,'Irrig Sched'!$BE$9:$BE$39,0))","v":""},{"$f":"INDEX('Irrig Sched'!$BH$9:$BH$39,MATCH(AB38,'Irrig Sched'!$BE$9:$BE$39,0))","v":""}]
[{"$f":"IF(AND(YEAR(MarOffset+22)=CalendarYear,MONTH(MarOffset+22)=3),DAY(MarOffset+22),\"\")","v":"1900-01-19"},{"$f":"IF(AND(YEAR(MarOffset+23)=CalendarYear,MONTH(MarOffset+23)=3),DAY(MarOffset+23),\"\")","v":"1900-01-20"},{"$f":"IF(AND(YEAR(MarOffset+24)=CalendarYear,MONTH(MarOffset+24)=3),DAY(MarOffset+24),\"\")","v":"1900-01-21"},{"$f":"IF(AND(YEAR(MarOffset+25)=CalendarYear,MONTH(MarOffset+25)=3),DAY(MarOffset+25),\"\")","v":"1900-01-22"},{"$f":"IF(AND(YEAR(MarOffset+26)=CalendarYear,MONTH(MarOffset+26)=3),DAY(MarOffset+26),\"\")","v":"1900-01-23"},{"$f":"IF(AND(YEAR(MarOffset+27)=CalendarYear,MONTH(MarOffset+27)=3),DAY(MarOffset+27),\"\")","v":"1900-01-24"},{"$f":"IF(AND(YEAR(MarOffset+28)=CalendarYear,MONTH(MarOffset+28)=3),DAY(MarOffset+28),\"\")","v":"1900-01-25"},{"$f":"IF(AND(YEAR(JunOffset+22)=CalendarYear,MONTH(JunOffset+22)=6),DAY(JunOffset+22),\"\")","v":"1900-01-18"},{"$f":"IF(AND(YEAR(JunOffset+23)=CalendarYear,MONTH(JunOffset+23)=6),DAY(JunOffset+23),\"\")","v":"1900-01-19"},{"$f":"IF(AND(YEAR(JunOffset+24)=CalendarYear,MONTH(JunOffset+24)=6),DAY(JunOffset+24),\"\")","v":"1900-01-20"},{"$f":"IF(AND(YEAR(JunOffset+25)=CalendarYear,MONTH(JunOffset+25)=6),DAY(JunOffset+25),\"\")","v":"1900-01-21"},{"$f":"IF(AND(YEAR(JunOffset+26)=CalendarYear,MONTH(JunOffset+26)=6),DAY(JunOffset+26),\"\")","v":"1900-01-22"},{"$f":"IF(AND(YEAR(JunOffset+27)=CalendarYear,MONTH(JunOffset+27)=6),DAY(JunOffset+27),\"\")","v":"1900-01-23"},{"$f":"IF(AND(YEAR(JunOffset+28)=CalendarYear,MONTH(JunOffset+28)=6),DAY(JunOffset+28),\"\")","v":"1900-01-24"},{"$f":"IF(AND(YEAR(SepOffset+22)=CalendarYear,MONTH(SepOffset+22)=9),DAY(SepOffset+22),\"\")","v":"1900-01-17"},{"$f":"IF(AND(YEAR(SepOffset+23)=CalendarYear,MONTH(SepOffset+23)=9),DAY(SepOffset+23),\"\")","v":"1900-01-18"},{"$f":"IF(AND(YEAR(SepOffset+24)=CalendarYear,MONTH(SepOffset+24)=9),DAY(SepOffset+24),\"\")","v":"1900-01-19"},{"$f":"IF(AND(YEAR(SepOffset+25)=CalendarYear,MONTH(SepOffset+25)=9),DAY(SepOffset+25),\"\")","v":"1900-01-20"},{"$f":"IF(AND(YEAR(SepOffset+26)=CalendarYear,MONTH(SepOffset+26)=9),DAY(SepOffset+26),\"\")","v":"1900-01-21"},{"$f":"IF(AND(YEAR(SepOffset+27)=CalendarYear,MONTH(SepOffset+27)=9),DAY(SepOffset+27),\"\")","v":"1900-01-22"},{"$f":"IF(AND(YEAR(SepOffset+28)=CalendarYear,MONTH(SepOffset+28)=9),DAY(SepOffset+28),\"\")","v":"1900-01-23"},{"$f":"IF(AND(YEAR(DecOffset+22)=CalendarYear,MONTH(DecOffset+22)=12),DAY(DecOffset+22),\"\")","v":"1900-01-17"},{"$f":"IF(AND(YEAR(DecOffset+23)=CalendarYear,MONTH(DecOffset+23)=12),DAY(DecOffset+23),\"\")","v":"1900-01-18"},{"$f":"IF(AND(YEAR(DecOffset+24)=CalendarYear,MONTH(DecOffset+24)=12),DAY(DecOffset+24),\"\")","v":"1900-01-19"},{"$f":"IF(AND(YEAR(DecOffset+25)=CalendarYear,MONTH(DecOffset+25)=12),DAY(DecOffset+25),\"\")","v":"1900-01-20"},{"$f":"IF(AND(YEAR(DecOffset+26)=CalendarYear,MONTH(DecOffset+26)=12),DAY(DecOffset+26),\"\")","v":"1900-01-21"},{"$f":"IF(AND(YEAR(DecOffset+27)=CalendarYear,MONTH(DecOffset+27)=12),DAY(DecOffset+27),\"\")","v":"1900-01-22"},{"$f":"IF(AND(YEAR(DecOffset+28)=CalendarYear,MONTH(DecOffset+28)=12),DAY(DecOffset+28),\"\")","v":"1900-01-23"}]
[{"$f":"INDEX('Irrig Sched'!$O$9:$O$39,MATCH(A40,'Irrig Sched'!$L$9:$L$39,0))","v":""},{"$f":"INDEX('Irrig Sched'!$O$9:$O$39,MATCH(B40,'Irrig Sched'!$L$9:$L$39,0))","v":""},{"$f":"INDEX('Irrig Sched'!$O$9:$O$39,MATCH(C40,'Irrig Sched'!$L$9:$L$39,0))","v":""},{"$f":"INDEX('Irrig Sched'!$O$9:$O$39,MATCH(D40,'Irrig Sched'!$L$9:$L$39,0))","v":""},{"$f":"INDEX('Irrig Sched'!$O$9:$O$39,MATCH(E40,'Irrig Sched'!$L$9:$L$39,0))","v":"Run"},{"$f":"INDEX('Irrig Sched'!$O$9:$O$39,MATCH(F40,'Irrig Sched'!$L$9:$L$39,0))","v":""},{"$f":"INDEX('Irrig Sched'!$O$9:$O$39,MATCH(G40,'Irrig Sched'!$L$9:$L$39,0))","v":""},{"$f":"INDEX('Irrig Sched'!$AD$9:$AD$39,MATCH(H40,'Irrig Sched'!$AA$9:$AA$39,0))","v":""},{"$f":"INDEX('Irrig Sched'!$AD$9:$AD$39,MATCH(I40,'Irrig Sched'!$AA$9:$AA$39,0))","v":""},{"$f":"INDEX('Irrig Sched'!$AD$9:$AD$39,MATCH(J40,'Irrig Sched'!$AA$9:$AA$39,0))","v":""},{"$f":"INDEX('Irrig Sched'!$AD$9:$AD$39,MATCH(K40,'Irrig Sched'!$AA$9:$AA$39,0))","v":""},{"$f":"INDEX('Irrig Sched'!$AD$9:$AD$39,MATCH(L40,'Irrig Sched'!$AA$9:$AA$39,0))","v":"Run"},{"$f":"INDEX('Irrig Sched'!$AD$9:$AD$39,MATCH(M40,'Irrig Sched'!$AA$9:$AA$39,0))","v":""},{"$f":"INDEX('Irrig Sched'!$AD$9:$AD$39,MATCH(N40,'Irrig Sched'!$AA$9:$AA$39,0))","v":""},{"$f":"INDEX('Irrig Sched'!$AS$9:$AS$39,MATCH(O40,'Irrig Sched'!$AP$9:$AP$39,0))","v":""},{"$f":"INDEX('Irrig Sched'!$AS$9:$AS$39,MATCH(P40,'Irrig Sched'!$AP$9:$AP$39,0))","v":""},{"$f":"INDEX('Irrig Sched'!$AS$9:$AS$39,MATCH(Q40,'Irrig Sched'!$AP$9:$AP$39,0))","v":""},{"$f":"INDEX('Irrig Sched'!$AS$9:$AS$39,MATCH(R40,'Irrig Sched'!$AP$9:$AP$39,0))","v":""},{"$f":"INDEX('Irrig Sched'!$AS$9:$AS$39,MATCH(S40,'Irrig Sched'!$AP$9:$AP$39,0))","v":"Run"},{"$f":"INDEX('Irrig Sched'!$AS$9:$AS$39,MATCH(T40,'Irrig Sched'!$AP$9:$AP$39,0))","v":""},{"$f":"INDEX('Irrig Sched'!$AS$9:$AS$39,MATCH(U40,'Irrig Sched'!$AP$9:$AP$39,0))","v":""},{"$f":"INDEX('Irrig Sched'!$BH$9:$BH$39,MATCH(V40,'Irrig Sched'!$BE$9:$BE$39,0))","v":""},{"$f":"INDEX('Irrig Sched'!$BH$9:$BH$39,MATCH(W40,'Irrig Sched'!$BE$9:$BE$39,0))","v":""},{"$f":"INDEX('Irrig Sched'!$BH$9:$BH$39,MATCH(X40,'Irrig Sched'!$BE$9:$BE$39,0))","v":"Run"},{"$f":"INDEX('Irrig Sched'!$BH$9:$BH$39,MATCH(Y40,'Irrig Sched'!$BE$9:$BE$39,0))","v":""},{"$f":"INDEX('Irrig Sched'!$BH$9:$BH$39,MATCH(Z40,'Irrig Sched'!$BE$9:$BE$39,0))","v":""},{"$f":"INDEX('Irrig Sched'!$BH$9:$BH$39,MATCH(AA40,'Irrig Sched'!$BE$9:$BE$39,0))","v":""},{"$f":"INDEX('Irrig Sched'!$BH$9:$BH$39,MATCH(AB40,'Irrig Sched'!$BE$9:$BE$39,0))","v":""}]
[{"$f":"IF(AND(YEAR(MarOffset+29)=CalendarYear,MONTH(MarOffset+29)=3),DAY(MarOffset+29),\"\")","v":"1900-01-26"},{"$f":"IF(AND(YEAR(MarOffset+30)=CalendarYear,MONTH(MarOffset+30)=3),DAY(MarOffset+30),\"\")","v":"1900-01-27"},{"$f":"IF(AND(YEAR(MarOffset+31)=CalendarYear,MONTH(MarOffset+31)=3),DAY(MarOffset+31),\"\")","v":"1900-01-28"},{"$f":"IF(AND(YEAR(MarOffset+32)=CalendarYear,MONTH(MarOffset+32)=3),DAY(MarOffset+32),\"\")","v":"1900-01-29"},{"$f":"IF(AND(YEAR(MarOffset+33)=CalendarYear,MONTH(MarOffset+33)=3),DAY(MarOffset+33),\"\")","v":"1900-01-30"},{"$f":"IF(AND(YEAR(MarOffset+34)=CalendarYear,MONTH(MarOffset+34)=3),DAY(MarOffset+34),\"\")","v":"1900-01-31"},{"$f":"IF(AND(YEAR(MarOffset+35)=CalendarYear,MONTH(MarOffset+35)=3),DAY(MarOffset+35),\"\")","v":""},{"$f":"IF(AND(YEAR(JunOffset+29)=CalendarYear,MONTH(JunOffset+29)=6),DAY(JunOffset+29),\"\")","v":"1900-01-25"},{"$f":"IF(AND(YEAR(JunOffset+30)=CalendarYear,MONTH(JunOffset+30)=6),DAY(JunOffset+30),\"\")","v":"1900-01-26"},{"$f":"IF(AND(YEAR(JunOffset+31)=CalendarYear,MONTH(JunOffset+31)=6),DAY(JunOffset+31),\"\")","v":"1900-01-27"},{"$f":"IF(AND(YEAR(JunOffset+32)=CalendarYear,MONTH(JunOffset+32)=6),DAY(JunOffset+32),\"\")","v":"1900-01-28"},{"$f":"IF(AND(YEAR(JunOffset+33)=CalendarYear,MONTH(JunOffset+33)=6),DAY(JunOffset+33),\"\")","v":"1900-01-29"},{"$f":"IF(AND(YEAR(JunOffset+34)=CalendarYear,MONTH(JunOffset+34)=6),DAY(JunOffset+34),\"\")","v":"1900-01-30"},{"$f":"IF(AND(YEAR(JunOffset+35)=CalendarYear,MONTH(JunOffset+35)=6),DAY(JunOffset+35),\"\")","v":""},{"$f":"IF(AND(YEAR(SepOffset+29)=CalendarYear,MONTH(SepOffset+29)=9),DAY(SepOffset+29),\"\")","v":"1900-01-24"},{"$f":"IF(AND(YEAR(SepOffset+30)=CalendarYear,MONTH(SepOffset+30)=9),DAY(SepOffset+30),\"\")","v":"1900-01-25"},{"$f":"IF(AND(YEAR(SepOffset+31)=CalendarYear,MONTH(SepOffset+31)=9),DAY(SepOffset+31),\"\")","v":"1900-01-26"},{"$f":"IF(AND(YEAR(SepOffset+32)=CalendarYear,MONTH(SepOffset+32)=9),DAY(SepOffset+32),\"\")","v":"1900-01-27"},{"$f":"IF(AND(YEAR(SepOffset+33)=CalendarYear,MONTH(SepOffset+33)=9),DAY(SepOffset+33),\"\")","v":"1900-01-28"},{"$f":"IF(AND(YEAR(SepOffset+34)=CalendarYear,MONTH(SepOffset+34)=9),DAY(SepOffset+34),\"\")","v":"1900-01-29"},{"$f":"IF(AND(YEAR(SepOffset+35)=CalendarYear,MONTH(SepOffset+35)=9),DAY(SepOffset+35),\"\")","v":"1900-01-30"},{"$f":"IF(AND(YEAR(DecOffset+29)=CalendarYear,MONTH(DecOffset+29)=12),DAY(DecOffset+29),\"\")","v":"1900-01-24"},{"$f":"IF(AND(YEAR(DecOffset+30)=CalendarYear,MONTH(DecOffset+30)=12),DAY(DecOffset+30),\"\")","v":"1900-01-25"},{"$f":"IF(AND(YEAR(DecOffset+31)=CalendarYear,MONTH(DecOffset+31)=12),DAY(DecOffset+31),\"\")","v":"1900-01-26"},{"$f":"IF(AND(YEAR(DecOffset+32)=CalendarYear,MONTH(DecOffset+32)=12),DAY(DecOffset+32),\"\")","v":"1900-01-27"},{"$f":"IF(AND(YEAR(DecOffset+33)=CalendarYear,MONTH(DecOffset+33)=12),DAY(DecOffset+33),\"\")","v":"1900-01-28"},{"$f":"IF(AND(YEAR(DecOffset+34)=CalendarYear,MONTH(DecOffset+34)=12),DAY(DecOffset+34),\"\")","v":"1900-01-29"},{"$f":"IF(AND(YEAR(DecOffset+35)=CalendarYear,MONTH(DecOffset+35)=12),DAY(DecOffset+35),\"\")","v":"1900-01-30"}]
[{"$f":"IF(A42=\"\",\"\",INDEX('Irrig Sched'!$O$9:$O$39,MATCH(A42,'Irrig Sched'!$L$9:$L$39,0)))","v":""},{"$f":"IF(B42=\"\",\"\",INDEX('Irrig Sched'!$O$9:$O$39,MATCH(B42,'Irrig Sched'!$L$9:$L$39,0)))","v":""},{"$f":"IF(C42=\"\",\"\",INDEX('Irrig Sched'!$O$9:$O$39,MATCH(C42,'Irrig Sched'!$L$9:$L$39,0)))","v":""},{"$f":"IF(D42=\"\",\"\",INDEX('Irrig Sched'!$O$9:$O$39,MATCH(D42,'Irrig Sched'!$L$9:$L$39,0)))","v":""},{"$f":"IF(E42=\"\",\"\",INDEX('Irrig Sched'!$O$9:$O$39,MATCH(E42,'Irrig Sched'!$L$9:$L$39,0)))","v":""},{"$f":"IF(F42=\"\",\"\",INDEX('Irrig Sched'!$O$9:$O$39,MATCH(F42,'Irrig Sched'!$L$9:$L$39,0)))","v":""},{"$f":"IF(G42=\"\",\"\",INDEX('Irrig Sched'!$O$9:$O$39,MATCH(G42,'Irrig Sched'!$L$9:$L$39,0)))","v":""},{"$f":"IF(H42=\"\",\"\",INDEX('Irrig Sched'!$AD$9:$AD$39,MATCH(H42,'Irrig Sched'!$AA$9:$AA$39,0)))","v":""},{"$f":"IF(I42=\"\",\"\",INDEX('Irrig Sched'!$AD$9:$AD$39,MATCH(I42,'Irrig Sched'!$AA$9:$AA$39,0)))","v":""},{"$f":"IF(J42=\"\",\"\",INDEX('Irrig Sched'!$AD$9:$AD$39,MATCH(J42,'Irrig Sched'!$AA$9:$AA$39,0)))","v":"Run"},{"$f":"IF(K42=\"\",\"\",INDEX('Irrig Sched'!$AD$9:$AD$39,MATCH(K42,'Irrig Sched'!$AA$9:$AA$39,0)))","v":""},{"$f":"IF(L42=\"\",\"\",INDEX('Irrig Sched'!$AD$9:$AD$39,MATCH(L42,'Irrig Sched'!$AA$9:$AA$39,0)))","v":"Run"},{"$f":"IF(M42=\"\",\"\",INDEX('Irrig Sched'!$AD$9:$AD$39,MATCH(M42,'Irrig Sched'!$AA$9:$AA$39,0)))","v":""},{"$f":"IF(N42=\"\",\"\",INDEX('Irrig Sched'!$AD$9:$AD$39,MATCH(N42,'Irrig Sched'!$AA$9:$AA$39,0)))","v":""},{"$f":"IF(O42=\"\",\"\",INDEX('Irrig Sched'!$AS$9:$AS$39,MATCH(O42,'Irrig Sched'!$AP$9:$AP$39,0)))","v":""},{"$f":"IF(P42=\"\",\"\",INDEX('Irrig Sched'!$AS$9:$AS$39,MATCH(P42,'Irrig Sched'!$AP$9:$AP$39,0)))","v":""},{"$f":"IF(Q42=\"\",\"\",INDEX('Irrig Sched'!$AS$9:$AS$39,MATCH(Q42,'Irrig Sched'!$AP$9:$AP$39,0)))","v":"Run"},{"$f":"IF(R42=\"\",\"\",INDEX('Irrig Sched'!$AS$9:$AS$39,MATCH(R42,'Irrig Sched'!$AP$9:$AP$39,0)))","v":""},{"$f":"IF(S42=\"\",\"\",INDEX('Irrig Sched'!$AS$9:$AS$39,MATCH(S42,'Irrig Sched'!$AP$9:$AP$39,0)))","v":""},{"$f":"IF(T42=\"\",\"\",INDEX('Irrig Sched'!$AS$9:$AS$39,MATCH(T42,'Irrig Sched'!$AP$9:$AP$39,0)))","v":""},{"$f":"IF(U42=\"\",\"\",INDEX('Irrig Sched'!$AS$9:$AS$39,MATCH(U42,'Irrig Sched'!$AP$9:$AP$39,0)))","v":""},{"$f":"IF(V42=\"\",\"\",INDEX('Irrig Sched'!$BH$9:$BH$39,MATCH(V42,'Irrig Sched'!$BE$9:$BE$39,0)))","v":""},{"$f":"IF(W42=\"\",\"\",INDEX('Irrig Sched'!$BH$9:$BH$39,MATCH(W42,'Irrig Sched'!$BE$9:$BE$39,0)))","v":""},{"$f":"IF(X42=\"\",\"\",INDEX('Irrig Sched'!$BH$9:$BH$39,MATCH(X42,'Irrig Sched'!$BE$9:$BE$39,0)))","v":""},{"$f":"IF(Y42=\"\",\"\",INDEX('Irrig Sched'!$BH$9:$BH$39,MATCH(Y42,'Irrig Sched'!$BE$9:$BE$39,0)))","v":""},{"$f":"IF(Z42=\"\",\"\",INDEX('Irrig Sched'!$BH$9:$BH$39,MATCH(Z42,'Irrig Sched'!$BE$9:$BE$39,0)))","v":""},{"$f":"IF(AA42=\"\",\"\",INDEX('Irrig Sched'!$BH$9:$BH$39,MATCH(AA42,'Irrig Sched'!$BE$9:$BE$39,0)))","v":""},{"$f":"IF(AB42=\"\",\"\",INDEX('Irrig Sched'!$BH$9:$BH$39,MATCH(AB42,'Irrig Sched'!$BE$9:$BE$39,0)))","v":""}]
[{"$f":"IF(AND(YEAR(MarOffset+36)=CalendarYear,MONTH(MarOffset+36)=3),DAY(MarOffset+36),\"\")","v":""},{"$f":"IF(AND(YEAR(MarOffset+37)=CalendarYear,MONTH(MarOffset+37)=3),DAY(MarOffset+37),\"\")","v":""},null,null,null,null,null,{"$f":"IF(AND(YEAR(JunOffset+36)=CalendarYear,MONTH(JunOffset+36)=6),DAY(JunOffset+36),\"\")","v":""},{"$f":"IF(AND(YEAR(JunOffset+37)=CalendarYear,MONTH(JunOffset+37)=6),DAY(JunOffset+37),\"\")","v":""},null,null,null,null,null,{"$f":"IF(AND(YEAR(SepOffset+36)=CalendarYear,MONTH(SepOffset+36)=9),DAY(SepOffset+36),\"\")","v":""},{"$f":"IF(AND(YEAR(SepOffset+37)=CalendarYear,MONTH(SepOffset+37)=9),DAY(SepOffset+37),\"\")","v":""},null,null,null,null,null,{"$f":"IF(AND(YEAR(DecOffset+36)=CalendarYear,MONTH(DecOffset+36)=12),DAY(DecOffset+36),\"\")","v":"1900-01-31"},{"$f":"IF(AND(YEAR(DecOffset+37)=CalendarYear,MONTH(DecOffset+37)=12),DAY(DecOffset+37),\"\")","v":""}]
[{"$f":"IF(A44=\"\",\"\",INDEX('Irrig Sched'!$O$9:$O$39,MATCH(A44,'Irrig Sched'!$L$9:$L$39,0)))","v":""},{"$f":"IF(B44=\"\",\"\",INDEX('Irrig Sched'!$O$9:$O$39,MATCH(B44,'Irrig Sched'!$L$9:$L$39,0)))","v":""},null,null,null,null,null,{"$f":"IF(H44=\"\",\"\",INDEX('Irrig Sched'!$AD$9:$AD$39,MATCH(H44,'Irrig Sched'!$AA$9:$AA$39,0)))","v":""},{"$f":"IF(I44=\"\",\"\",INDEX('Irrig Sched'!$AD$9:$AD$39,MATCH(I44,'Irrig Sched'!$AA$9:$AA$39,0)))","v":""},null,null,null,null,null,{"$f":"IF(O44=\"\",\"\",INDEX('Irrig Sched'!$AS$9:$AS$39,MATCH(O44,'Irrig Sched'!$AP$9:$AP$39,0)))","v":""},{"$f":"IF(P44=\"\",\"\",INDEX('Irrig Sched'!$AS$9:$AS$39,MATCH(P44,'Irrig Sched'!$AP$9:$AP$39,0)))","v":""},null,null,null,null,null,{"$f":"IF(V44=\"\",\"\",INDEX('Irrig Sched'!$BH$9:$BH$39,MATCH(V44,'Irrig Sched'!$BE$9:$BE$39,0)))","v":""},{"$f":"IF(W44=\"\",\"\",INDEX('Irrig Sched'!$BH$9:$BH$39,MATCH(W44,'Irrig Sched'!$BE$9:$BE$39,0)))","v":""}]

{"sheet":"ETo Zones Map","index":8,"n_rows":38,"n_cols":23,"rows_kept":38,"cut":false,"hidden":false,"merged":[[1,9,8,22],[37,9,41,22]]}
[]
[null,null,null,null,null,null,null,null,null,"Find your location on the map and identify the ETo zone.  Enter the ETo zone number in the ETo, Soil, C.C., Irr Info. page.  Locate the ETo zone in the chart below.  The numbers in the cells to the right of the zone number are the average monthly inches of irrgation needed to irrigate the reference crop.  These numbers are used in calculating the irrigation calendar to guide you in adjusting your controller to match the water demand of the plants in your landscape."]
[]
[]
[]
[]
[]
[]
[]
[]
[null,null,null,null,null,null,null,null,null,"From the California Irrigation Management Information System (CIMIS)"]
[null,null,null,null,null,null,null,null,null,"http://wwwcimis.water.ca.gov"]
[null,null,null,null,null,null,null,null,null,"The map is located in the brochure at:"]
[null,null,null,null,null,null,null,null,null,"http://wwwcimis.water.ca.gov/Content/pdf/CimisRefEvapZones.pdf"]
[]
[]
[null,null,null,null,null,null,null,null,null,"Monthly Average Reference Evapotranspiration byETo Zone (inches/month)"]
[null,null,null,null,null,null,null,null,null,"Zone","Jan","Feb","Mar","Apr","May","Jun","Jul","Aug","Sep","Oct","Nov","Dec","Total"]
[null,null,null,null,null,null,null,null,null,1,0.93,1.4,2.48,3.3,4.03,4.5,4.6500000000000004,4.03,3.3,2.48,1.2,0.62,{"$f":"SUM(K19:V19)","v":32.92}]
[null,null,null,null,null,null,null,null,null,2,1.24,1.68,3.1,3.9,4.6500000000000004,5.0999999999999996,4.96,4.6500000000000004,3.9,2.79,1.8,1.24,{"$f":"SUM(K20:V20)","v":39.01}]
[null,null,null,null,null,null,null,null,null,3,1.86,2.2400000000000002,3.72,4.8,5.27,5.7,5.58,5.27,4.2,3.41,2.4,1.86,46.309999999999995]
[null,null,null,null,null,null,null,null,null,4,1.86,2.2400000000000002,3.41,4.5,5.27,5.7,5.89,5.58,4.5,3.41,2.4,1.86,46.62]
[null,null,null,null,null,null,null,null,null,5,0.93,1.68,2.79,4.2,5.58,6.3,6.51,5.89,4.5,3.1,1.5,0.93,43.910000000000004]
[null,null,null,null,null,null,null,null,null,6,1.86,2.2400000000000002,3.41,4.8,5.58,6.3,6.51,6.2,4.8,3.72,2.4,1.86,49.68]
[null,null,null,null,null,null,null,null,null,7,0.62,1.4,2.48,3.9,5.27,6.3,7.44,6.51,4.8,2.79,1.2,0.62,43.33]
[null,null,null,null,null,null,null,null,null,8,1.24,1.68,3.41,4.8,6.2,6.9,7.44,6.51,5.0999999999999996,3.41,1.8,0.93,{"$f":"SUM(K26:V26)","v":49.419999999999995}]
[null,null,null,null,null,null,null,null,null,9,2.17,2.8,4.03,5.0999999999999996,5.89,6.6,7.44,6.82,5.7,4.0599999999999996,2.7,1.86,55.17]
[null,null,null,null,null,null,null,null,null,10,0.93,1.68,3.1,4.5,5.89,7.2,8.06,7.13,5.0999999999999996,3.1,1.5,0.93,49.120000000000005]
[null,null,null,null,null,null,null,null,null,11,1.55,2.2400000000000002,3.1,4.5,5.89,7.2,8.06,7.44,5.7,3.72,2.1,1.55,53.05]
[null,null,null,null,null,null,null,null,null,12,1.24,1.96,3.41,5.0999999999999996,6.82,7.8,8.06,7.13,5.4,3.72,1.8,0.93,53.37]
[null,null,null,null,null,null,null,null,null,13,1.24,1.96,3.1,4.8,6.51,7.8,8.99,7.75,5.7,3.72,1.8,0.93,54.3]
[null,null,null,null,null,null,null,null,null,14,1.55,2.2400000000000002,3.72,5.0999999999999996,6.82,7.8,8.68,7.75,5.7,4.03,2.1,1.55,57.04]
[null,null,null,null,null,null,null,null,null,15,1.24,2.2400000000000002,3.72,5.7,7.44,8.1,8.68,7.75,5.7,4.03,2.1,1.24,57.940000000000012]
[null,null,null,null,null,null,null,null,null,16,1.55,2.52,4.03,5.7,7.75,8.6999999999999993,9.3000000000000007,8.3699999999999992,6.3,4.34,2.4,1.55,62.509999999999984]
[null,null,null,null,null,null,null,null,null,17,1.86,2.8,4.6500000000000004,6,8.06,9,9.92,8.68,6.6,4.34,2.7,1.86,66.470000000000013]
[null,null,null,null,null,null,null,null,null,18,2.48,3.36,5.27,6.9,8.68,9.6,9.61,8.68,6.9,4.96,3,2.17,71.61]
[]
[null,null,null,null,null,null,null,null,null,"Variability between stations within single zones is as high as 0.02 inches per day for zone 1 and during winter months in zone 13.  The average standard deviation of the ETo between estimation sites within a zone is about 0.01 inches per day for the 200 sites used to develop the map."]

{"sheet":"SOIL INFORMATION","index":9,"n_rows":20,"n_cols":5,"rows_kept":20,"cut":false,"hidden":true,"merged":[[4,0,4,1],[2,4,4,4],[2,3,4,3],[2,2,4,2]]}
["Soil Information"]
[]
["Depth to wet (in.):",{"$f":"Depth_To_Wet","v":12},"Infiltration*\n(in./hr)","Plant Avail Water (cm/cm)**","Irrig to wet to depth \n(in)†"]
[]
["Soil Texture "]
["Coarse ","sand / fine sand",1.5,0.05,{"$f":"$B$3*D6*0.5","v":0.30000000000000004}]
[null,"loamy sand ",1,7.0000000000000007E-2,{"$f":"$B$3*D7*0.5","v":0.42000000000000004}]
["Moderately Coarse","sandy loam",0.8,0.11,0.66]
["Medium","loam",0.4,0.16,0.96]
[null,"silty loam ",0.25,0.2,1.2000000000000002]
[null,"silt",0.3,0.2,1.2000000000000002]
["Moderately Fine","sandy clay loam",0.1,0.15,0.89999999999999991]
[null,"clay loam",7.0000000000000007E-2,0.16,0.96]
[null,"silty clay loam",0.05,0.18,1.08]
["Fine","sandy clay",0.08,0.12,0.72]
[null,"silty clay",0.05,0.14000000000000001,0.84000000000000008]
[null,"clay",0.05,0.15,0.89999999999999991]
[null,"*Also known as intake rate"]
[null,"**IA Landscape Irrigation Auditor Manual page 177"]
[null,"†assume 50% dry down (managed allowable depletion)"]

{"sheet":"DU CALCS \"mL.\"","index":10,"n_rows":51,"n_cols":13,"rows_kept":51,"cut":false,"hidden":true,"merged":[[0,0,0,5],[3,0,3,2],[4,0,4,2],[1,0,1,5],[48,0,48,1],[52,0,52,1],[53,0,53,1],[50,0,50,1],[49,0,49,1],[50,3,50,4]]}
["System Efficiency and Watering Schedule  "]
["Determine values for each of the sections below and enter values into the fields provided.\nNote:  fields highlighted in  green must be filled out in order for other calculations in the spread sheet to work properly."]
[]
["Catch can throat area (sq. in) use: πr2 ",null,null,{"$f":"Throat_area","v":16.600000000000001}]
["Elapsed Time (Minutes):",null,null,{"$f":"Runtime","v":6}]
[null,null,null,null,null,null,null,null,null,null,"% applied target:",0.9]
["Container #","Volume (ml)","Depth (in.)","Precip. Rate (in./hr)","Rank","LowQ",null,"Used for Ranking",null,"Used to determine runtime and # of cycles"]
[1,{"$f":"IF('Catch Can Field Worksheet'!B13=\"\", \"\",'Catch Can Field Worksheet'!B13)","v":35},{"$f":"IF(B8<>\"\",B8*0.061/$D$4,\"\")","v":0.12861445783132527},{"$f":"IF(C8<>\"\",C8/$D$5*60,\"\")","v":1.2861445783132528},{"$f":"IF(B8<>\"\",RANK(H8,$H$8:$H$47,1),\"\")","v":32},{"$f":"IF(E8<=$C$49/4,B8,\"\")","v":""},null,{"$f":"IF(D8<>\"\",B8+A8/1000,\"\")","v":35.000999999999998},null,"check","Runtime","# cycles","% applied"]
[2,{"$f":"IF('Catch Can Field Worksheet'!B14=\"\", \"\",'Catch Can Field Worksheet'!B14)","v":30},{"$f":"IF(B9<>\"\",B9*0.061/$D$4,\"\")","v":0.11024096385542168},{"$f":"IF(C9<>\"\",C9/$D$5*60,\"\")","v":1.1024096385542168},20,"",null,30.001999999999999,null,{"$f":"IF(M9>=Applied_Target,1,0)","v":1},{"$f":"Time_to_Runoff","v":12},{"$f":"INT(Max_Duration/K9)","v":4},{"$f":"(K9*L9)/Max_Duration","v":0.97959183673469385}]
[3,{"$f":"IF('Catch Can Field Worksheet'!B15=\"\", \"\",'Catch Can Field Worksheet'!B15)","v":20},7.349397590361445E-2,0.7349397590361445,4,20,null,20.003,null,{"$f":"IF(SUM(J$9:J9)=0,IF(M10>=Applied_Target,1,0),0)","v":0},{"$f":"K9-1","v":11},4,0.89795918367346939]
[4,{"$f":"IF('Catch Can Field Worksheet'!B16=\"\", \"\",'Catch Can Field Worksheet'!B16)","v":20},7.349397590361445E-2,0.7349397590361445,5,20,null,20.004000000000001,null,{"$f":"IF(SUM(J$9:J10)=0,IF(M11>=Applied_Target,1,0),0)","v":0},10,4,0.81632653061224492]
[5,{"$f":"IF('Catch Can Field Worksheet'!B17=\"\", \"\",'Catch Can Field Worksheet'!B17)","v":25},9.1867469879518063E-2,0.9186746987951806,13,"",null,25.004999999999999,null,{"$f":"IF(SUM(J$9:J11)=0,IF(M12>=Applied_Target,1,0),0)","v":0},9,5,0.91836734693877553]
[6,{"$f":"IF('Catch Can Field Worksheet'!B18=\"\", \"\",'Catch Can Field Worksheet'!B18)","v":35},0.12861445783132527,1.2861445783132528,33,"",null,35.006,null,{"$f":"IF(SUM(J$9:J12)=0,IF(M13>=Applied_Target,1,0),0)","v":0},8,6,0.97959183673469385]
[7,{"$f":"IF('Catch Can Field Worksheet'!B19=\"\", \"\",'Catch Can Field Worksheet'!B19)","v":15},5.5120481927710838E-2,0.5512048192771084,2,15,null,15.007,null,{"$f":"IF(SUM(J$9:J13)=0,IF(M14>=Applied_Target,1,0),0)","v":0},7,7,1]
[8,{"$f":"IF('Catch Can Field Worksheet'!B20=\"\", \"\",'Catch Can Field Worksheet'!B20)","v":20},{"$f":"IF(B15<>\"\",B15*0.061/$D$4,\"\")","v":7.349397590361445E-2},0.7349397590361445,6,20,null,20.007999999999999,null,{"$f":"IF(SUM(J$9:J14)=0,IF(M15>=Applied_Target,1,0),0)","v":0},6,8,0.97959183673469385]
[9,{"$f":"IF('Catch Can Field Worksheet'!B21=\"\", \"\",'Catch Can Field Worksheet'!B21)","v":40},0.1469879518072289,1.469879518072289,35,"",null,40.009,null,{"$f":"IF(SUM(J$9:J15)=0,IF(M16>=Applied_Target,1,0),0)","v":0},5,9,0.91836734693877553]
[10,{"$f":"IF('Catch Can Field Worksheet'!B22=\"\", \"\",'Catch Can Field Worksheet'!B22)","v":20},7.349397590361445E-2,0.7349397590361445,7,20,null,20.010000000000002,null,{"$f":"IF(SUM(J$9:J16)=0,IF(M17>=Applied_Target,1,0),0)","v":0},4,12,0.97959183673469385]
[11,{"$f":"IF('Catch Can Field Worksheet'!D13=\"\", \"\",'Catch Can Field Worksheet'!D13)","v":15},5.5120481927710838E-2,0.5512048192771084,3,15,null,15.010999999999999,null,{"$f":"IF(SUM(J$9:J17)=0,IF(M18>=Applied_Target,1,0),0)","v":0},3,16,0.97959183673469385]
[12,{"$f":"IF('Catch Can Field Worksheet'!D14=\"\", \"\",'Catch Can Field Worksheet'!D14)","v":20},7.349397590361445E-2,0.7349397590361445,8,20,null,20.012,null,{"$f":"IF(SUM(J$9:J18)=0,IF(M19>=Applied_Target,1,0),0)","v":0},2,24,0.97959183673469385]
[13,{"$f":"IF('Catch Can Field Worksheet'!D15=\"\", \"\",'Catch Can Field Worksheet'!D15)","v":40},0.1469879518072289,1.469879518072289,36,"",null,40.012999999999998,null,{"$f":"IF(SUM(J$9:J19)=0,IF(M20>=Applied_Target,1,0),0)","v":0},1,49,1]
[14,{"$f":"IF('Catch Can Field Worksheet'!D16=\"\", \"\",'Catch Can Field Worksheet'!D16)","v":25},9.1867469879518063E-2,0.9186746987951806,14,"",null,25.013999999999999,null,{"$f":"IF(SUM(J$9:J20)=0,IF(M21>=Applied_Target,1,0),0)","v":0},0,{"$error":"#DIV/0!"},{"$error":"#DIV/0!"}]
[15,{"$f":"IF('Catch Can Field Worksheet'!D17=\"\", \"\",'Catch Can Field Worksheet'!D17)","v":35},0.12861445783132527,1.2861445783132528,34,"",null,35.015000000000001,null,{"$f":"IF(SUM(J$9:J21)=0,IF(M22>=Applied_Target,1,0),0)","v":0},-1,-49,1]
[16,{"$f":"IF('Catch Can Field Worksheet'!D18=\"\", \"\",'Catch Can Field Worksheet'!D18)","v":25},9.1867469879518063E-2,0.9186746987951806,15,"",null,25.015999999999998,null,{"$f":"IF(SUM(J$9:J22)=0,IF(M23>=Applied_Target,1,0),0)","v":0},-2,-25,1.0204081632653061]
[17,{"$f":"IF('Catch Can Field Worksheet'!D19=\"\", \"\",'Catch Can Field Worksheet'!D19)","v":30},0.11024096385542168,1.1024096385542168,21,"",null,30.016999999999999]
[18,{"$f":"IF('Catch Can Field Worksheet'!D20=\"\", \"\",'Catch Can Field Worksheet'!D20)","v":30},0.11024096385542168,1.1024096385542168,22,"",null,30.018000000000001]
[19,{"$f":"IF('Catch Can Field Worksheet'!D21=\"\", \"\",'Catch Can Field Worksheet'!D21)","v":40},0.1469879518072289,1.469879518072289,37,"",null,40.018999999999998]
[20,{"$f":"IF('Catch Can Field Worksheet'!D22=\"\", \"\",'Catch Can Field Worksheet'!D22)","v":40},0.1469879518072289,1.469879518072289,38,"",null,40.020000000000003]
[21,{"$f":"IF('Catch Can Field Worksheet'!F13=\"\", \"\",'Catch Can Field Worksheet'!F13)","v":25},9.1867469879518063E-2,0.9186746987951806,16,"",null,25.021000000000001]
[22,{"$f":"IF('Catch Can Field Worksheet'!F14=\"\", \"\",'Catch Can Field Worksheet'!F14)","v":30},0.11024096385542168,1.1024096385542168,23,"",null,30.021999999999998]
[23,{"$f":"IF('Catch Can Field Worksheet'!F15=\"\", \"\",'Catch Can Field Worksheet'!F15)","v":40},0.1469879518072289,1.469879518072289,39,"",null,40.023000000000003]
[24,{"$f":"IF('Catch Can Field Worksheet'!F16=\"\", \"\",'Catch Can Field Worksheet'!F16)","v":30},0.11024096385542168,1.1024096385542168,24,"",null,30.024000000000001]
[25,{"$f":"IF('Catch Can Field Worksheet'!F17=\"\", \"\",'Catch Can Field Worksheet'!F17)","v":40},0.1469879518072289,1.469879518072289,40,"",null,40.024999999999999]
[26,{"$f":"IF('Catch Can Field Worksheet'!F18=\"\", \"\",'Catch Can Field Worksheet'!F18)","v":30},0.11024096385542168,1.1024096385542168,25,"",null,30.026]
[27,{"$f":"IF('Catch Can Field Worksheet'!F19=\"\", \"\",'Catch Can Field Worksheet'!F19)","v":30},0.11024096385542168,1.1024096385542168,26,"",null,30.027000000000001]
[28,{"$f":"IF('Catch Can Field Worksheet'!F20=\"\", \"\",'Catch Can Field Worksheet'!F20)","v":30},0.11024096385542168,1.1024096385542168,27,"",null,30.027999999999999]
[29,{"$f":"IF('Catch Can Field Worksheet'!F21=\"\", \"\",'Catch Can Field Worksheet'!F21)","v":20},7.349397590361445E-2,0.7349397590361445,9,20,null,20.029]
[30,{"$f":"IF('Catch Can Field Worksheet'!F22=\"\", \"\",'Catch Can Field Worksheet'!F22)","v":20},7.349397590361445E-2,0.7349397590361445,10,20,null,20.03]
[31,{"$f":"IF('Catch Can Field Worksheet'!H13=\"\", \"\",'Catch Can Field Worksheet'!H13)","v":25},9.1867469879518063E-2,0.9186746987951806,17,"",null,25.030999999999999]
[32,{"$f":"IF('Catch Can Field Worksheet'!H14=\"\", \"\",'Catch Can Field Worksheet'!H14)","v":25},9.1867469879518063E-2,0.9186746987951806,18,"",null,25.032]
[33,{"$f":"IF('Catch Can Field Worksheet'!H15=\"\", \"\",'Catch Can Field Worksheet'!H15)","v":30},0.11024096385542168,1.1024096385542168,28,"",null,30.033000000000001]
[34,{"$f":"IF('Catch Can Field Worksheet'!H16=\"\", \"\",'Catch Can Field Worksheet'!H16)","v":30},0.11024096385542168,1.1024096385542168,29,"",null,30.033999999999999]
[35,{"$f":"IF('Catch Can Field Worksheet'!H17=\"\", \"\",'Catch Can Field Worksheet'!H17)","v":10},3.6746987951807225E-2,0.36746987951807225,1,10,null,10.035]
[36,{"$f":"IF('Catch Can Field Worksheet'!H18=\"\", \"\",'Catch Can Field Worksheet'!H18)","v":30},0.11024096385542168,1.1024096385542168,30,"",null,30.036000000000001]
[37,{"$f":"IF('Catch Can Field Worksheet'!H19=\"\", \"\",'Catch Can Field Worksheet'!H19)","v":20},7.349397590361445E-2,0.7349397590361445,11,"",null,20.036999999999999]
[38,{"$f":"IF('Catch Can Field Worksheet'!H20=\"\", \"\",'Catch Can Field Worksheet'!H20)","v":25},9.1867469879518063E-2,0.9186746987951806,19,"",null,25.038]
[39,{"$f":"IF('Catch Can Field Worksheet'!H21=\"\", \"\",'Catch Can Field Worksheet'!H21)","v":20},7.349397590361445E-2,0.7349397590361445,12,"",null,20.039000000000001]
[40,{"$f":"IF('Catch Can Field Worksheet'!H22=\"\", \"\",'Catch Can Field Worksheet'!H22)","v":30},{"$f":"IF(B47<>\"\",B47*0.061/$D$4,\"\")","v":0.11024096385542168},{"$f":"IF(C47<>\"\",C47/$D$5*60,\"\")","v":1.1024096385542168},31,"",null,30.04]
["Average",{"$f":"AVERAGE(B8:B47)","v":27.5},{"$f":"B48*0.061/$D$4","v":0.10105421686746988},{"$f":"C48/$D$5*60","v":1.0105421686746989},null,{"$f":"AVERAGE(F8:F47)","v":18}]
["Count",null,{"$f":"COUNT(B8:B47)","v":40}]
["DU",null,{"$f":"F48/B48","v":0.65454545454545454},"AvgLQ/AvgT"]
["PR (in/hr)",null,{"$f":"D48","v":1.0105421686746989},"Avg precip rate"]

{"sheet":"DAILY ETo","index":11,"n_rows":25,"n_cols":18,"rows_kept":25,"cut":false,"hidden":true,"merged":[[3,10,4,10],[3,3,3,5],[3,9,4,9],[3,8,4,8]]}
[]
[]
[]
[null,null,null,"Run time",null,null,null,null,"ModifiedDaily ETo (in.)","no. days between irr"]
["Month","Monthly ETo","ETo x KL","Monthly (min/mo)","Weekly (min/wk)","Daily (min/da)","no. irrig\n/mo","no.days /mo",null,null,null,"Year",{"$f":"'ETo, Soil, C.C., Irr Info.'!D31","v":2017},null,"DayOfWeek and Designated days"]
["Jan",{"$f":"VLOOKUP(ETo_Zone,ETo_Zone_Chart,2)","v":1.55},{"$f":"B6*KL","v":0.92999999999999994},{"$f":"(B6*KL*60)/PR*SM","v":69.655587306361852},{"$f":"ROUND(D6/H6*7,0)","v":16},{"$f":"ROUND(D6/H6,0)","v":2},{"$f":"ROUND(D6/Time_to_wet_d,0)","v":2},31,{"$f":"C6/H6","v":0.03},{"$f":"in_to_wet_d/I6","v":22.000000000000004},null,"JanOffset",{"$f":"DATE(CalendarYear,1,1)-WEEKDAY(DATE(CalendarYear,1,1))","v":"2016-12-31"},null,1,"Sun",{"$f":"IF(R6=FALSE,0,1)","v":0},false]
["Feb",{"$f":"VLOOKUP(ETo_Zone,ETo_Zone_Chart,3)","v":2.2400000000000002},1.3440000000000001,100.66355842983907,25,4,3,{"$f":"IF('Irrig Sched'!G4=\" is a Leap Year\",29,28)","v":28},{"$f":"C7/H7","v":4.8000000000000001E-2},13.75,null,"FebOffSet",{"$f":"DATE(CalendarYear,2,1)-WEEKDAY(DATE(CalendarYear,2,1))","v":"2017-01-28"},null,2,"Mon",{"$f":"IF(R7=FALSE,0,1)","v":0},false]
["Mar",{"$f":"VLOOKUP(ETo_Zone,ETo_Zone_Chart,4)","v":3.72},2.2320000000000002,167.17340953526849,38,5,4,31,7.2000000000000008E-2,9.1666666666666661,null,"MarOffset",{"$f":"DATE(CalendarYear,3,1)-WEEKDAY(DATE(CalendarYear,3,1))","v":"2017-02-25"},null,3,"Tue",1,true]
["Apr",{"$f":"VLOOKUP(ETo_Zone,ETo_Zone_Chart,5)","v":5.0999999999999996},3.0599999999999996,229.18935178222284,53,8,6,30,0.10199999999999999,6.4705882352941186,null,"AprOffset",{"$f":"DATE(CalendarYear,4,1)-WEEKDAY(DATE(CalendarYear,4,1))","v":"2017-03-25"},null,4,"Wed",0,false]
["May",{"$f":"VLOOKUP(ETo_Zone,ETo_Zone_Chart,6)","v":6.82},4.0919999999999996,306.48458414799217,69,10,8,31,0.13199999999999998,5.0000000000000009,null,"MayOffset",{"$f":"DATE(CalendarYear,5,1)-WEEKDAY(DATE(CalendarYear,5,1))","v":"2017-04-29"},null,5,"Thu",1,true]
["Jun",{"$f":"VLOOKUP(ETo_Zone,ETo_Zone_Chart,7)","v":7.8},4.68,350.52489096104671,82,12,9,30,0.156,4.2307692307692308,null,"JunOffset",{"$f":"DATE(CalendarYear,6,1)-WEEKDAY(DATE(CalendarYear,6,1))","v":"2017-05-27"},null,6,"Fri",0,false]
["Jul",{"$f":"VLOOKUP(ETo_Zone,ETo_Zone_Chart,8)","v":8.68},5.2079999999999993,390.07128891562633,88,13,10,31,0.16799999999999998,3.9285714285714293,null,"JulOffset",{"$f":"DATE(CalendarYear,7,1)-WEEKDAY(DATE(CalendarYear,7,1))","v":"2017-06-24"},null,7,"Sat",1,true]
["Aug",{"$f":"VLOOKUP(ETo_Zone,ETo_Zone_Chart,9)","v":7.75},4.6499999999999995,348.27793653180919,79,11,9,31,0.15,4.4000000000000004,null,"AugOffset",{"$f":"DATE(CalendarYear,8,1)-WEEKDAY(DATE(CalendarYear,8,1))","v":"2017-07-29"}]
["Sep",{"$f":"VLOOKUP(ETo_Zone,ETo_Zone_Chart,10)","v":5.7},3.42,256.15280493307262,60,9,7,30,0.114,5.7894736842105265,null,"SepOffset",{"$f":"DATE(CalendarYear,9,1)-WEEKDAY(DATE(CalendarYear,9,1))","v":"2017-08-26"},null,null,"Count",{"$f":"SUM(Q6:Q12)","v":3}]
["Oct",{"$f":"VLOOKUP(ETo_Zone,ETo_Zone_Chart,11)","v":4.03},2.4180000000000001,181.10452699654084,41,6,5,31,7.8E-2,8.4615384615384617,null,"OctOffset",{"$f":"DATE(CalendarYear,10,1)-WEEKDAY(DATE(CalendarYear,10,1))","v":"2017-09-30"},null,null,"Approx days to next water",{"$f":"7/Q14-1","v":1.3333333333333335}]
["Nov",{"$f":"VLOOKUP(ETo_Zone,ETo_Zone_Chart,12)","v":2.1},1.26,94.37208602797412,22,3,2,30,4.2000000000000003E-2,15.714285714285714,null,"NovOffset",{"$f":"DATE(CalendarYear,11,1)-WEEKDAY(DATE(CalendarYear,11,1))","v":"2017-10-28"}]
["Dec",{"$f":"VLOOKUP(ETo_Zone,ETo_Zone_Chart,13)*KL","v":0.92999999999999994},0.55799999999999994,41.793352383817115,9,1,1,31,1.7999999999999999E-2,36.666666666666671,null,"DecOffset",{"$f":"DATE(CalendarYear,12,1)-WEEKDAY(DATE(CalendarYear,12,1))","v":"2017-11-25"}]
["Total",{"$f":"SUM(B6:B17)","v":56.42},{"$f":"SUM(C6:C17)","v":33.851999999999997},null,null,null,null,{"$f":"SUM(H6:H17)","v":365}]
["Max",{"$f":"MAX(B6:B17)","v":8.68},{"$f":"MAX(C6:C17)","v":5.2079999999999993}]
[]
[]
["This irrigation advice:"]
[null,null,"Assumes replacing water at 50% depletion"]
[null,null,"Does not consider Kmc (microclimate factor), Kd (landsacpe density), or"]
[null,null,"other factors."]

{"sheet":"Irrig Sched","index":12,"n_rows":39,"n_cols":60,"rows_kept":39,"cut":false,"hidden":true,"merged":[[7,50,7,54],[7,55,7,59],[7,0,7,4],[7,5,7,9],[7,10,7,14],[7,15,7,19],[7,20,7,24],[7,25,7,29],[7,30,7,34],[7,35,7,39],[7,40,7,44],[7,45,7,49]]}
["Irrigation schedule"]
["Days of each month to run irrigation cycle"]
[]
[null,null,null,null,"Irrig year: ",{"$f":"Irrig_Year","v":2017},{"$f":"IF(OR(MOD(Irrig_Year,400)=0,AND(MOD(Irrig_Year,4)=0,MOD(Irrig_Year,100)<>0)),\" is a Leap Year\", \" is NOT a Leap Year\")","v":" is NOT a Leap Year"}]
[null,null,null,null,"Amount applied: ",{"$f":"Amt_Applied","v":0.64653061224489794}," In."]
[]
[null,null,"IrrDay",{"$f":"'DAILY ETo'!I6","v":0.03},null,null,null,"IrrDay",{"$f":"'DAILY ETo'!I7","v":4.8000000000000001E-2},null,null,null,"IrrDay",{"$f":"'DAILY ETo'!I8","v":7.2000000000000008E-2},null,null,null,"IrrDay",{"$f":"'DAILY ETo'!I9","v":0.10199999999999999},null,null,null,"IrrDay",{"$f":"'DAILY ETo'!I10","v":0.13199999999999998},null,null,null,"IrrDay",{"$f":"'DAILY ETo'!I11","v":0.156},null,null,null,"IrrDay",{"$f":"'DAILY ETo'!I12","v":0.16799999999999998},null,null,null,"IrrDay",{"$f":"'DAILY ETo'!I13","v":0.15},null,null,null,"IrrDay",{"$f":"'DAILY ETo'!I14","v":0.114},null,null,null,"IrrDay",{"$f":"'DAILY ETo'!I15","v":7.8E-2},null,null,null,"IrrDay",{"$f":"'DAILY ETo'!I16","v":4.2000000000000003E-2},null,null,null,"IrrDay",{"$f":"'DAILY ETo'!I17","v":1.7999999999999999E-2}]
["Jan",null,null,null,null,"Feb",null,null,null,null,"Mar",null,null,null,null,"Apr",null,null,null,null,"May",null,null,null,null,"Jun",null,null,null,null,"Jul",null,null,null,null,"Aug",null,null,null,null,"Sep",null,null,null,null,"Oct",null,null,null,null,"Nov",null,null,null,null,"Dec"]
[{"$f":"VLOOKUP(WEEKDAY(DATE(CalendarYear,1,B9)),DayOfWeek,2)","v":"Sun"},1,{"$f":"INDEX('DAILY ETo'!$Q$6:$Q$12,(MATCH(A9,'DAILY ETo'!$P$6:$P$12,0)))","v":0},{"$f":"D7","v":0.03},{"$f":"IF(Amt_Applied>=JanETo,\"\",\"Run\")","v":""},{"$f":"VLOOKUP(WEEKDAY(DATE(CalendarYear,2,B9)),DayOfWeek,2)","v":"Wed"},1,{"$f":"INDEX('DAILY ETo'!$Q$6:$Q$12,(MATCH(F9,'DAILY ETo'!$P$6:$P$12,0)))","v":0},{"$f":"IF(Amt_Applied>=Days_Btn_Irrig*I$7+D39,I$7+D39,IF(H9=1,I$7+D39-Amt_Applied,I$7+D39))","v":0.33146938775510243},{"$f":"IF(Amt_Applied>=Days_Btn_Irrig*I$7+D39,\"\",IF(H9=1,\"Run\",\"\"))","v":""},{"$f":"VLOOKUP(WEEKDAY(DATE(CalendarYear,3,B9)),DayOfWeek,2)","v":"Wed"},1,{"$f":"INDEX('DAILY ETo'!$Q$6:$Q$12,(MATCH(K9,'DAILY ETo'!$P$6:$P$12,0)))","v":0},{"$f":"IF(G4=\" is a Leap Year\",IF(Amt_Applied>=Days_Btn_Irrig*N$7+I37,N$7+I37,IF(M9=1,N$7+I37-Amt_Applied,N$7+I37)), IF(Amt_Applied>=Days_Btn_Irrig*N$7+I36,N$7+I36,IF(M9=1,N$7+I36-Amt_Applied,N$7+I36)))","v":0.40640816326530677},{"$f":"IF(G4=\" is a Leap Year\",IF(Amt_Applied>=Days_Btn_Irrig*N$7+I37,\"\",IF(M9=1,\"Run\",\"\")),IF(Amt_Applied>=Days_Btn_Irrig*N$7+I36,\"\",IF(M9=1,\"Run\",\"\")))","v":""},{"$f":"VLOOKUP(WEEKDAY(DATE(CalendarYear,4,B9)),DayOfWeek,2)","v":"Sat"},1,{"$f":"INDEX('DAILY ETo'!$Q$6:$Q$12,(MATCH(P9,'DAILY ETo'!$P$6:$P$12,0)))","v":1},{"$f":"IF(Amt_Applied>=Days_Btn_Irrig*S$7+N39,S$7+N39,IF(R9=1,S$7+N39-Amt_Applied,S$7+N39))","v":8.2285714285715739E-2},{"$f":"IF(Amt_Applied>=Days_Btn_Irrig*S$7+N39,\"\",IF(R9=1,\"Run\",\"\"))","v":"Run"},{"$f":"VLOOKUP(WEEKDAY(DATE(CalendarYear,5,B9)),DayOfWeek,2)","v":"Mon"},1,{"$f":"INDEX('DAILY ETo'!$Q$6:$Q$12,(MATCH(U9,'DAILY ETo'!$P$6:$P$12,0)))","v":0},{"$f":"IF(Amt_Applied>=Days_Btn_Irrig*X$7+S38,X$7+S38,IF(W9=1,X$7+S38-Amt_Applied,X$7+S38))","v":0.5861632653061235},{"$f":"IF(Amt_Applied>=Days_Btn_Irrig*X$7+S38,\"\",IF(W9=1,\"Run\",\"\"))","v":""},{"$f":"VLOOKUP(WEEKDAY(DATE(CalendarYear,6,B9)),DayOfWeek,2)","v":"Thu"},1,{"$f":"INDEX('DAILY ETo'!$Q$6:$Q$12,(MATCH(Z9,'DAILY ETo'!$P$6:$P$12,0)))","v":1},{"$f":"IF(Amt_Applied>=Days_Btn_Irrig*AC$7+X39,AC$7+X39,IF(AB9=1,AC$7+X39-Amt_Applied,AC$7+X39))","v":0.17644897959183781},{"$f":"IF(Amt_Applied>=Days_Btn_Irrig*AC$7+X39,\"\",IF(AB9=1,\"Run\",\"\"))","v":"Run"},{"$f":"VLOOKUP(WEEKDAY(DATE(CalendarYear,7,B9)),DayOfWeek,2)","v":"Sat"},1,{"$f":"INDEX('DAILY ETo'!$Q$6:$Q$12,(MATCH(AE9,'DAILY ETo'!$P$6:$P$12,0)))","v":1},{"$f":"IF(Amt_Applied>=Days_Btn_Irrig*AH$7+AC38,AH$7+AC38,IF(AG9=1,AH$7+AC38-Amt_Applied,AH$7+AC38))","v":0.34273469387755273},{"$f":"IF(Amt_Applied>=Days_Btn_Irrig*AH$7+AC38,\"\",IF(AG9=1,\"Run\",\"\"))","v":""},{"$f":"VLOOKUP(WEEKDAY(DATE(CalendarYear,8,B9)),DayOfWeek,2)","v":"Tue"},1,{"$f":"INDEX('DAILY ETo'!$Q$6:$Q$12,(MATCH(AJ9,'DAILY ETo'!$P$6:$P$12,0)))","v":1},{"$f":"IF(Amt_Applied>=Days_Btn_Irrig*AM$7+AH39,AM$7+AH39,IF(AL9=1,AM$7+AH39-Amt_Applied,AM$7+AH39))","v":0.36048979591836861},{"$f":"IF(Amt_Applied>=Days_Btn_Irrig*AM$7+AH39,\"\",IF(AL9=1,\"Run\",\"\"))","v":"Run"},{"$f":"VLOOKUP(WEEKDAY(DATE(CalendarYear,9,B9)),DayOfWeek,2)","v":"Fri"},1,{"$f":"INDEX('DAILY ETo'!$Q$6:$Q$12,(MATCH(AO9,'DAILY ETo'!$P$6:$P$12,0)))","v":0},{"$f":"IF(Amt_Applied>=Days_Btn_Irrig*AR$7+AM39,AR$7+AM39,IF(AQ9=1,AR$7+AM39-Amt_Applied,AR$7+AM39))","v":0.44877551020408341},{"$f":"IF(Amt_Applied>=Days_Btn_Irrig*AR$7+AM39,\"\",IF(AQ9=1,\"Run\",\"\"))","v":""},{"$f":"VLOOKUP(WEEKDAY(DATE(CalendarYear,10,B9)),DayOfWeek,2)","v":"Sun"},1,{"$f":"INDEX('DAILY ETo'!$Q$6:$Q$12,(MATCH(AT9,'DAILY ETo'!$P$6:$P$12,0)))","v":0},{"$f":"IF(Amt_Applied>=Days_Btn_Irrig*AW$7+AR38,AW$7+AR38,IF(AV9=1,AW$7+AR38-Amt_Applied,AW$7+AR38))","v":0.60012244897959355},{"$f":"IF(Amt_Applied>=Days_Btn_Irrig*AW$7+AR38,\"\",IF(AV9=1,\"Run\",\"\"))","v":""},{"$f":"VLOOKUP(WEEKDAY(DATE(CalendarYear,11,B9)),DayOfWeek,2)","v":"Wed"},1,{"$f":"INDEX('DAILY ETo'!$Q$6:$Q$12,(MATCH(AY9,'DAILY ETo'!$P$6:$P$12,0)))","v":0},{"$f":"IF(Amt_Applied>=Days_Btn_Irrig*BB$7+AW39,BB$7+AW39,IF(BA9=1,BB$7+AW39-Amt_Applied,BB$7+AW39))","v":0.39600000000000168},{"$f":"IF(Amt_Applied>=Days_Btn_Irrig*BB$7+AW39,\"\",IF(BA9=1,\"Run\",\"\"))","v":""},{"$f":"VLOOKUP(WEEKDAY(DATE(CalendarYear,12,B9)),DayOfWeek,2)","v":"Fri"},1,{"$f":"INDEX('DAILY ETo'!$Q$6:$Q$12,(MATCH(BD9,'DAILY ETo'!$P$6:$P$12,0)))","v":0},{"$f":"IF(Amt_Applied>=Days_Btn_Irrig*BG$7+BB38,BG$7+BB38,IF(BF9=1,BG$7+BB38-Amt_Applied,BG$7+BB38))","v":0.33893877551020601},{"$f":"IF(Amt_Applied>=Days_Btn_Irrig*BG$7+BB38,\"\",IF(BF9=1,\"Run\",\"\"))","v":""}]
[{"$f":"VLOOKUP(WEEKDAY(DATE(CalendarYear,1,B10)),DayOfWeek,2)","v":"Mon"},2,{"$f":"INDEX('DAILY ETo'!$Q$6:$Q$12,(MATCH(A10,'DAILY ETo'!$P$6:$P$12,0)))","v":0},{"$f":"IF(Amt_Applied>=Days_Btn_Irrig*D$7+D9,D$7+D9,IF(C10=1,D$7+D9-Amt_Applied,D$7+D9))","v":0.06},{"$f":"IF(Amt_Applied>=Days_Btn_Irrig*D$7+D9,\"\",IF(C10=1,\"Run\",\"\"))","v":""},"Thu",2,{"$f":"INDEX('DAILY ETo'!$Q$6:$Q$12,(MATCH(F10,'DAILY ETo'!$P$6:$P$12,0)))","v":1},{"$f":"IF(Amt_Applied>=Days_Btn_Irrig*I$7+I9,I$7+I9,IF(H10=1,I$7+I9-Amt_Applied,I$7+I9))","v":0.37946938775510242},{"$f":"IF(Amt_Applied>=Days_Btn_Irrig*I$7+I9,\"\",IF(H10=1,\"Run\",\"\"))","v":""},"Thu",2,{"$f":"INDEX('DAILY ETo'!$Q$6:$Q$12,(MATCH(K10,'DAILY ETo'!$P$6:$P$12,0)))","v":1},{"$f":"IF(Amt_Applied>=Days_Btn_Irrig*N$7+N9,N$7+N9,IF(M10=1,N$7+N9-Amt_Applied,N$7+N9))","v":0.47840816326530677},{"$f":"IF(Amt_Applied>=Days_Btn_Irrig*N$7+N9,\"\",IF(M10=1,\"Run\",\"\"))","v":""},"Sun",2,{"$f":"INDEX('DAILY ETo'!$Q$6:$Q$12,(MATCH(P10,'DAILY ETo'!$P$6:$P$12,0)))","v":0},{"$f":"IF(Amt_Applied>=Days_Btn_Irrig*S$7+S9,S$7+S9,IF(R10=1,S$7+S9-Amt_Applied,S$7+S9))","v":0.18428571428571572},{"$f":"IF(Amt_Applied>=Days_Btn_Irrig*S$7+S9,\"\",IF(R10=1,\"Run\",\"\"))","v":""},"Tue",2,{"$f":"INDEX('DAILY ETo'!$Q$6:$Q$12,(MATCH(U10,'DAILY ETo'!$P$6:$P$12,0)))","v":1},{"$f":"IF(Amt_Applied>=Days_Btn_Irrig*X$7+X9,X$7+X9,IF(W10=1,X$7+X9-Amt_Applied,X$7+X9))","v":7.1632653061225571E-2},{"$f":"IF(Amt_Applied>=Days_Btn_Irrig*X$7+X9,\"\",IF(W10=1,\"Run\",\"\"))","v":"Run"},"Fri",2,{"$f":"INDEX('DAILY ETo'!$Q$6:$Q$12,(MATCH(Z10,'DAILY ETo'!$P$6:$P$12,0)))","v":0},{"$f":"IF(Amt_Applied>=Days_Btn_Irrig*AC$7+AC9,AC$7+AC9,IF(AB10=1,AC$7+AC9-Amt_Applied,AC$7+AC9))","v":0.33244897959183783},{"$f":"IF(Amt_Applied>=Days_Btn_Irrig*AC$7+AC9,\"\",IF(AB10=1,\"Run\",\"\"))","v":""},"Sun",2,{"$f":"INDEX('DAILY ETo'!$Q$6:$Q$12,(MATCH(AE10,'DAILY ETo'!$P$6:$P$12,0)))","v":0},{"$f":"IF(Amt_Applied>=Days_Btn_Irrig*AH$7+AH9,AH$7+AH9,IF(AG10=1,AH$7+AH9-Amt_Applied,AH$7+AH9))","v":0.51073469387755277},{"$f":"IF(Amt_Applied>=Days_Btn_Irrig*AH$7+AH9,\"\",IF(AG10=1,\"Run\",\"\"))","v":""},"Wed",2,{"$f":"INDEX('DAILY ETo'!$Q$6:$Q$12,(MATCH(AJ10,'DAILY ETo'!$P$6:$P$12,0)))","v":0},{"$f":"IF(Amt_Applied>=Days_Btn_Irrig*AM$7+AM9,AM$7+AM9,IF(AL10=1,AM$7+AM9-Amt_Applied,AM$7+AM9))","v":0.51048979591836863},{"$f":"IF(Amt_Applied>=Days_Btn_Irrig*AM$7+AM9,\"\",IF(AL10=1,\"Run\",\"\"))","v":""},"Sat",2,{"$f":"INDEX('DAILY ETo'!$Q$6:$Q$12,(MATCH(AO10,'DAILY ETo'!$P$6:$P$12,0)))","v":1},{"$f":"IF(Amt_Applied>=Days_Btn_Irrig*AR$7+AR9,AR$7+AR9,IF(AQ10=1,AR$7+AR9-Amt_Applied,AR$7+AR9))","v":0.56277551020408345},{"$f":"IF(Amt_Applied>=Days_Btn_Irrig*AR$7+AR9,\"\",IF(AQ10=1,\"Run\",\"\"))","v":""},"Mon",2,{"$f":"INDEX('DAILY ETo'!$Q$6:$Q$12,(MATCH(AT10,'DAILY ETo'!$P$6:$P$12,0)))","v":0},{"$f":"IF(Amt_Applied>=Days_Btn_Irrig*AW$7+AW9,AW$7+AW9,IF(AV10=1,AW$7+AW9-Amt_Applied,AW$7+AW9))","v":0.67812244897959351},{"$f":"IF(Amt_Applied>=Days_Btn_Irrig*AW$7+AW9,\"\",IF(AV10=1,\"Run\",\"\"))","v":""},"Thu",2,{"$f":"INDEX('DAILY ETo'!$Q$6:$Q$12,(MATCH(AY10,'DAILY ETo'!$P$6:$P$12,0)))","v":1},{"$f":"IF(Amt_Applied>=Days_Btn_Irrig*BB$7+BB9,BB$7+BB9,IF(BA10=1,BB$7+BB9-Amt_Applied,BB$7+BB9))","v":0.43800000000000167},{"$f":"IF(Amt_Applied>=Days_Btn_Irrig*BB$7+BB9,\"\",IF(BA10=1,\"Run\",\"\"))","v":""},"Sat",2,{"$f":"INDEX('DAILY ETo'!$Q$6:$Q$12,(MATCH(BD10,'DAILY ETo'!$P$6:$P$12,0)))","v":1},{"$f":"IF(Amt_Applied>=Days_Btn_Irrig*BG$7+BG9,BG$7+BG9,IF(BF10=1,BG$7+BG9-Amt_Applied,BG$7+BG9))","v":0.35693877551020603},{"$f":"IF(Amt_Applied>=Days_Btn_Irrig*BG$7+BG9,\"\",IF(BF10=1,\"Run\",\"\"))","v":""}]
["Tue",3,{"$f":"INDEX('DAILY ETo'!$Q$6:$Q$12,(MATCH(A11,'DAILY ETo'!$P$6:$P$12,0)))","v":1},{"$f":"IF(Amt_Applied>=Days_Btn_Irrig*D$7+D10,D$7+D10,IF(C11=1,D$7+D10-Amt_Applied,D$7+D10))","v":0.09},"","Fri",3,{"$f":"INDEX('DAILY ETo'!$Q$6:$Q$12,(MATCH(F11,'DAILY ETo'!$P$6:$P$12,0)))","v":0},0.4274693877551024,"","Fri",3,{"$f":"INDEX('DAILY ETo'!$Q$6:$Q$12,(MATCH(K11,'DAILY ETo'!$P$6:$P$12,0)))","v":0},0.55040816326530684,"","Mon",3,{"$f":"INDEX('DAILY ETo'!$Q$6:$Q$12,(MATCH(P11,'DAILY ETo'!$P$6:$P$12,0)))","v":0},0.2862857142857157,"","Wed",3,{"$f":"INDEX('DAILY ETo'!$Q$6:$Q$12,(MATCH(U11,'DAILY ETo'!$P$6:$P$12,0)))","v":0},0.20363265306122555,"","Sat",3,{"$f":"INDEX('DAILY ETo'!$Q$6:$Q$12,(MATCH(Z11,'DAILY ETo'!$P$6:$P$12,0)))","v":1},0.48844897959183786,"","Mon",3,{"$f":"INDEX('DAILY ETo'!$Q$6:$Q$12,(MATCH(AE11,'DAILY ETo'!$P$6:$P$12,0)))","v":0},0.6787346938775527,"","Thu",3,{"$f":"INDEX('DAILY ETo'!$Q$6:$Q$12,(MATCH(AJ11,'DAILY ETo'!$P$6:$P$12,0)))","v":1},1.395918367347071E-2,"Run","Sun",3,{"$f":"INDEX('DAILY ETo'!$Q$6:$Q$12,(MATCH(AO11,'DAILY ETo'!$P$6:$P$12,0)))","v":0},0.67677551020408344,"","Tue",3,{"$f":"INDEX('DAILY ETo'!$Q$6:$Q$12,(MATCH(AT11,'DAILY ETo'!$P$6:$P$12,0)))","v":1},0.10959183673469552,"Run","Fri",3,{"$f":"INDEX('DAILY ETo'!$Q$6:$Q$12,(MATCH(AY11,'DAILY ETo'!$P$6:$P$12,0)))","v":0},0.48000000000000165,"","Sun",3,{"$f":"INDEX('DAILY ETo'!$Q$6:$Q$12,(MATCH(BD11,'DAILY ETo'!$P$6:$P$12,0)))","v":0},0.37493877551020605,""]
["Wed",4,{"$f":"INDEX('DAILY ETo'!$Q$6:$Q$12,(MATCH(A12,'DAILY ETo'!$P$6:$P$12,0)))","v":0},0.12,"","Sat",4,{"$f":"INDEX('DAILY ETo'!$Q$6:$Q$12,(MATCH(F12,'DAILY ETo'!$P$6:$P$12,0)))","v":1},0.47546938775510239,"","Sat",4,{"$f":"INDEX('DAILY ETo'!$Q$6:$Q$12,(MATCH(K12,'DAILY ETo'!$P$6:$P$12,0)))","v":1},0.6224081632653069,"","Tue",4,{"$f":"INDEX('DAILY ETo'!$Q$6:$Q$12,(MATCH(P12,'DAILY ETo'!$P$6:$P$12,0)))","v":1},0.38828571428571568,"","Thu",4,{"$f":"INDEX('DAILY ETo'!$Q$6:$Q$12,(MATCH(U12,'DAILY ETo'!$P$6:$P$12,0)))","v":1},0.33563265306122553,"","Sun",4,{"$f":"INDEX('DAILY ETo'!$Q$6:$Q$12,(MATCH(Z12,'DAILY ETo'!$P$6:$P$12,0)))","v":0},0.64444897959183789,"","Tue",4,{"$f":"INDEX('DAILY ETo'!$Q$6:$Q$12,(MATCH(AE12,'DAILY ETo'!$P$6:$P$12,0)))","v":1},0.20020408163265468,"Run","Fri",4,{"$f":"INDEX('DAILY ETo'!$Q$6:$Q$12,(MATCH(AJ12,'DAILY ETo'!$P$6:$P$12,0)))","v":0},0.1639591836734707,"","Mon",4,{"$f":"INDEX('DAILY ETo'!$Q$6:$Q$12,(MATCH(AO12,'DAILY ETo'!$P$6:$P$12,0)))","v":0},0.79077551020408343,"","Wed",4,{"$f":"INDEX('DAILY ETo'!$Q$6:$Q$12,(MATCH(AT12,'DAILY ETo'!$P$6:$P$12,0)))","v":0},0.18759183673469554,"","Sat",4,{"$f":"INDEX('DAILY ETo'!$Q$6:$Q$12,(MATCH(AY12,'DAILY ETo'!$P$6:$P$12,0)))","v":1},0.52200000000000168,"","Mon",4,{"$f":"INDEX('DAILY ETo'!$Q$6:$Q$12,(MATCH(BD12,'DAILY ETo'!$P$6:$P$12,0)))","v":0},0.39293877551020606,""]
["Thu",5,{"$f":"INDEX('DAILY ETo'!$Q$6:$Q$12,(MATCH(A13,'DAILY ETo'!$P$6:$P$12,0)))","v":1},0.15,"","Sun",5,{"$f":"INDEX('DAILY ETo'!$Q$6:$Q$12,(MATCH(F13,'DAILY ETo'!$P$6:$P$12,0)))","v":0},0.52346938775510243,"","Sun",5,{"$f":"INDEX('DAILY ETo'!$Q$6:$Q$12,(MATCH(K13,'DAILY ETo'!$P$6:$P$12,0)))","v":0},0.69440816326530697,"","Wed",5,{"$f":"INDEX('DAILY ETo'!$Q$6:$Q$12,(MATCH(P13,'DAILY ETo'!$P$6:$P$12,0)))","v":0},0.49028571428571566,"","Fri",5,{"$f":"INDEX('DAILY ETo'!$Q$6:$Q$12,(MATCH(U13,'DAILY ETo'!$P$6:$P$12,0)))","v":0},0.46763265306122548,"","Mon",5,{"$f":"INDEX('DAILY ETo'!$Q$6:$Q$12,(MATCH(Z13,'DAILY ETo'!$P$6:$P$12,0)))","v":0},0.80044897959183792,"","Wed",5,{"$f":"INDEX('DAILY ETo'!$Q$6:$Q$12,(MATCH(AE13,'DAILY ETo'!$P$6:$P$12,0)))","v":0},0.36820408163265467,"","Sat",5,{"$f":"INDEX('DAILY ETo'!$Q$6:$Q$12,(MATCH(AJ13,'DAILY ETo'!$P$6:$P$12,0)))","v":1},0.3139591836734707,"","Tue",5,{"$f":"INDEX('DAILY ETo'!$Q$6:$Q$12,(MATCH(AO13,'DAILY ETo'!$P$6:$P$12,0)))","v":1},0.25824489795918548,"Run","Thu",5,{"$f":"INDEX('DAILY ETo'!$Q$6:$Q$12,(MATCH(AT13,'DAILY ETo'!$P$6:$P$12,0)))","v":1},0.26559183673469555,"","Sun",5,{"$f":"INDEX('DAILY ETo'!$Q$6:$Q$12,(MATCH(AY13,'DAILY ETo'!$P$6:$P$12,0)))","v":0},0.56400000000000172,"","Tue",5,{"$f":"INDEX('DAILY ETo'!$Q$6:$Q$12,(MATCH(BD13,'DAILY ETo'!$P$6:$P$12,0)))","v":1},0.41093877551020608,""]
["Fri",6,{"$f":"INDEX('DAILY ETo'!$Q$6:$Q$12,(MATCH(A14,'DAILY ETo'!$P$6:$P$12,0)))","v":0},0.18,"","Mon",6,{"$f":"INDEX('DAILY ETo'!$Q$6:$Q$12,(MATCH(F14,'DAILY ETo'!$P$6:$P$12,0)))","v":0},0.57146938775510248,"","Mon",6,{"$f":"INDEX('DAILY ETo'!$Q$6:$Q$12,(MATCH(K14,'DAILY ETo'!$P$6:$P$12,0)))","v":0},0.76640816326530703,"","Thu",6,{"$f":"INDEX('DAILY ETo'!$Q$6:$Q$12,(MATCH(P14,'DAILY ETo'!$P$6:$P$12,0)))","v":1},0.59228571428571564,"","Sat",6,{"$f":"INDEX('DAILY ETo'!$Q$6:$Q$12,(MATCH(U14,'DAILY ETo'!$P$6:$P$12,0)))","v":1},0.59963265306122548,"","Tue",6,{"$f":"INDEX('DAILY ETo'!$Q$6:$Q$12,(MATCH(Z14,'DAILY ETo'!$P$6:$P$12,0)))","v":1},0.30991836734694,"Run","Thu",6,{"$f":"INDEX('DAILY ETo'!$Q$6:$Q$12,(MATCH(AE14,'DAILY ETo'!$P$6:$P$12,0)))","v":1},0.53620408163265465,"","Sun",6,{"$f":"INDEX('DAILY ETo'!$Q$6:$Q$12,(MATCH(AJ14,'DAILY ETo'!$P$6:$P$12,0)))","v":0},0.46395918367347067,"","Wed",6,{"$f":"INDEX('DAILY ETo'!$Q$6:$Q$12,(MATCH(AO14,'DAILY ETo'!$P$6:$P$12,0)))","v":0},0.37224489795918547,"","Fri",6,{"$f":"INDEX('DAILY ETo'!$Q$6:$Q$12,(MATCH(AT14,'DAILY ETo'!$P$6:$P$12,0)))","v":0},0.34359183673469557,"","Mon",6,{"$f":"INDEX('DAILY ETo'!$Q$6:$Q$12,(MATCH(AY14,'DAILY ETo'!$P$6:$P$12,0)))","v":0},0.60600000000000176,"","Wed",6,{"$f":"INDEX('DAILY ETo'!$Q$6:$Q$12,(MATCH(BD14,'DAILY ETo'!$P$6:$P$12,0)))","v":0},0.42893877551020609,""]
["Sat",7,{"$f":"INDEX('DAILY ETo'!$Q$6:$Q$12,(MATCH(A15,'DAILY ETo'!$P$6:$P$12,0)))","v":1},0.21,"","Tue",7,{"$f":"INDEX('DAILY ETo'!$Q$6:$Q$12,(MATCH(F15,'DAILY ETo'!$P$6:$P$12,0)))","v":1},0.61946938775510252,"","Tue",7,{"$f":"INDEX('DAILY ETo'!$Q$6:$Q$12,(MATCH(K15,'DAILY ETo'!$P$6:$P$12,0)))","v":1},0.19187755102040915,"Run","Fri",7,{"$f":"INDEX('DAILY ETo'!$Q$6:$Q$12,(MATCH(P15,'DAILY ETo'!$P$6:$P$12,0)))","v":0},0.69428571428571562,"","Sun",7,{"$f":"INDEX('DAILY ETo'!$Q$6:$Q$12,(MATCH(U15,'DAILY ETo'!$P$6:$P$12,0)))","v":0},0.73163265306122549,"","Wed",7,{"$f":"INDEX('DAILY ETo'!$Q$6:$Q$12,(MATCH(Z15,'DAILY ETo'!$P$6:$P$12,0)))","v":0},0.46591836734694003,"","Fri",7,{"$f":"INDEX('DAILY ETo'!$Q$6:$Q$12,(MATCH(AE15,'DAILY ETo'!$P$6:$P$12,0)))","v":0},0.70420408163265469,"","Mon",7,{"$f":"INDEX('DAILY ETo'!$Q$6:$Q$12,(MATCH(AJ15,'DAILY ETo'!$P$6:$P$12,0)))","v":0},0.61395918367347069,"","Thu",7,{"$f":"INDEX('DAILY ETo'!$Q$6:$Q$12,(MATCH(AO15,'DAILY ETo'!$P$6:$P$12,0)))","v":1},0.48624489795918546,"","Sat",7,{"$f":"INDEX('DAILY ETo'!$Q$6:$Q$12,(MATCH(AT15,'DAILY ETo'!$P$6:$P$12,0)))","v":1},0.42159183673469558,"","Tue",7,{"$f":"INDEX('DAILY ETo'!$Q$6:$Q$12,(MATCH(AY15,'DAILY ETo'!$P$6:$P$12,0)))","v":1},1.469387755103857E-3,"Run","Thu",7,{"$f":"INDEX('DAILY ETo'!$Q$6:$Q$12,(MATCH(BD15,'DAILY ETo'!$P$6:$P$12,0)))","v":1},0.44693877551020611,""]
["Sun",8,{"$f":"INDEX('DAILY ETo'!$Q$6:$Q$12,(MATCH(A16,'DAILY ETo'!$P$6:$P$12,0)))","v":0},0.24,"","Wed",8,{"$f":"INDEX('DAILY ETo'!$Q$6:$Q$12,(MATCH(F16,'DAILY ETo'!$P$6:$P$12,0)))","v":0},0.66746938775510256,"","Wed",8,{"$f":"INDEX('DAILY ETo'!$Q$6:$Q$12,(MATCH(K16,'DAILY ETo'!$P$6:$P$12,0)))","v":0},0.26387755102040916,"","Sat",8,{"$f":"INDEX('DAILY ETo'!$Q$6:$Q$12,(MATCH(P16,'DAILY ETo'!$P$6:$P$12,0)))","v":1},0.14975510204081766,"Run","Mon",8,{"$f":"INDEX('DAILY ETo'!$Q$6:$Q$12,(MATCH(U16,'DAILY ETo'!$P$6:$P$12,0)))","v":0},0.8636326530612255,"","Thu",8,{"$f":"INDEX('DAILY ETo'!$Q$6:$Q$12,(MATCH(Z16,'DAILY ETo'!$P$6:$P$12,0)))","v":1},-2.461224489795788E-2,"Run","Sat",8,{"$f":"INDEX('DAILY ETo'!$Q$6:$Q$12,(MATCH(AE16,'DAILY ETo'!$P$6:$P$12,0)))","v":1},0.22567346938775668,"Run","Tue",8,{"$f":"INDEX('DAILY ETo'!$Q$6:$Q$12,(MATCH(AJ16,'DAILY ETo'!$P$6:$P$12,0)))","v":1},0.11742857142857277,"Run","Fri",8,{"$f":"INDEX('DAILY ETo'!$Q$6:$Q$12,(MATCH(AO16,'DAILY ETo'!$P$6:$P$12,0)))","v":0},0.60024489795918545,"","Sun",8,{"$f":"INDEX('DAILY ETo'!$Q$6:$Q$12,(MATCH(AT16,'DAILY ETo'!$P$6:$P$12,0)))","v":0},0.49959183673469559,"","Wed",8,{"$f":"INDEX('DAILY ETo'!$Q$6:$Q$12,(MATCH(AY16,'DAILY ETo'!$P$6:$P$12,0)))","v":0},4.346938775510386E-2,"","Fri",8,{"$f":"INDEX('DAILY ETo'!$Q$6:$Q$12,(MATCH(BD16,'DAILY ETo'!$P$6:$P$12,0)))","v":0},0.46493877551020613,""]
["Mon",9,{"$f":"INDEX('DAILY ETo'!$Q$6:$Q$12,(MATCH(A17,'DAILY ETo'!$P$6:$P$12,0)))","v":0},0.27,"","Thu",9,{"$f":"INDEX('DAILY ETo'!$Q$6:$Q$12,(MATCH(F17,'DAILY ETo'!$P$6:$P$12,0)))","v":1},6.8938775510204664E-2,"Run","Thu",9,{"$f":"INDEX('DAILY ETo'!$Q$6:$Q$12,(MATCH(K17,'DAILY ETo'!$P$6:$P$12,0)))","v":1},0.33587755102040917,"","Sun",9,{"$f":"INDEX('DAILY ETo'!$Q$6:$Q$12,(MATCH(P17,'DAILY ETo'!$P$6:$P$12,0)))","v":0},0.25175510204081764,"","Tue",9,{"$f":"INDEX('DAILY ETo'!$Q$6:$Q$12,(MATCH(U17,'DAILY ETo'!$P$6:$P$12,0)))","v":1},0.34910204081632756,"Run","Fri",9,{"$f":"INDEX('DAILY ETo'!$Q$6:$Q$12,(MATCH(Z17,'DAILY ETo'!$P$6:$P$12,0)))","v":0},0.13138775510204212,"","Sun",9,{"$f":"INDEX('DAILY ETo'!$Q$6:$Q$12,(MATCH(AE17,'DAILY ETo'!$P$6:$P$12,0)))","v":0},0.39367346938775666,"","Wed",9,{"$f":"INDEX('DAILY ETo'!$Q$6:$Q$12,(MATCH(AJ17,'DAILY ETo'!$P$6:$P$12,0)))","v":0},0.26742857142857279,"","Sat",9,{"$f":"INDEX('DAILY ETo'!$Q$6:$Q$12,(MATCH(AO17,'DAILY ETo'!$P$6:$P$12,0)))","v":1},6.7714285714287503E-2,"Run","Mon",9,{"$f":"INDEX('DAILY ETo'!$Q$6:$Q$12,(MATCH(AT17,'DAILY ETo'!$P$6:$P$12,0)))","v":0},0.57759183673469561,"","Thu",9,{"$f":"INDEX('DAILY ETo'!$Q$6:$Q$12,(MATCH(AY17,'DAILY ETo'!$P$6:$P$12,0)))","v":1},8.5469387755103862E-2,"","Sat",9,{"$f":"INDEX('DAILY ETo'!$Q$6:$Q$12,(MATCH(BD17,'DAILY ETo'!$P$6:$P$12,0)))","v":1},0.48293877551020614,""]
["Tue",10,{"$f":"INDEX('DAILY ETo'!$Q$6:$Q$12,(MATCH(A18,'DAILY ETo'!$P$6:$P$12,0)))","v":1},0.30000000000000004,"","Fri",10,{"$f":"INDEX('DAILY ETo'!$Q$6:$Q$12,(MATCH(F18,'DAILY ETo'!$P$6:$P$12,0)))","v":0},0.11693877551020466,"","Fri",10,{"$f":"INDEX('DAILY ETo'!$Q$6:$Q$12,(MATCH(K18,'DAILY ETo'!$P$6:$P$12,0)))","v":0},0.40787755102040918,"","Mon",10,{"$f":"INDEX('DAILY ETo'!$Q$6:$Q$12,(MATCH(P18,'DAILY ETo'!$P$6:$P$12,0)))","v":0},0.35375510204081762,"","Wed",10,{"$f":"INDEX('DAILY ETo'!$Q$6:$Q$12,(MATCH(U18,'DAILY ETo'!$P$6:$P$12,0)))","v":0},0.48110204081632757,"","Sat",10,{"$f":"INDEX('DAILY ETo'!$Q$6:$Q$12,(MATCH(Z18,'DAILY ETo'!$P$6:$P$12,0)))","v":1},0.28738775510204212,"","Mon",10,{"$f":"INDEX('DAILY ETo'!$Q$6:$Q$12,(MATCH(AE18,'DAILY ETo'!$P$6:$P$12,0)))","v":0},0.56167346938775664,"","Thu",10,{"$f":"INDEX('DAILY ETo'!$Q$6:$Q$12,(MATCH(AJ18,'DAILY ETo'!$P$6:$P$12,0)))","v":1},0.41742857142857281,"","Sun",10,{"$f":"INDEX('DAILY ETo'!$Q$6:$Q$12,(MATCH(AO18,'DAILY ETo'!$P$6:$P$12,0)))","v":0},0.18171428571428749,"","Tue",10,{"$f":"INDEX('DAILY ETo'!$Q$6:$Q$12,(MATCH(AT18,'DAILY ETo'!$P$6:$P$12,0)))","v":1},9.0612244897976257E-3,"Run","Fri",10,{"$f":"INDEX('DAILY ETo'!$Q$6:$Q$12,(MATCH(AY18,'DAILY ETo'!$P$6:$P$12,0)))","v":0},0.12746938775510386,"","Sun",10,{"$f":"INDEX('DAILY ETo'!$Q$6:$Q$12,(MATCH(BD18,'DAILY ETo'!$P$6:$P$12,0)))","v":0},0.50093877551020616,""]
["Wed",11,{"$f":"INDEX('DAILY ETo'!$Q$6:$Q$12,(MATCH(A19,'DAILY ETo'!$P$6:$P$12,0)))","v":0},0.33000000000000007,"","Sat",11,{"$f":"INDEX('DAILY ETo'!$Q$6:$Q$12,(MATCH(F19,'DAILY ETo'!$P$6:$P$12,0)))","v":1},0.16493877551020467,"","Sat",11,{"$f":"INDEX('DAILY ETo'!$Q$6:$Q$12,(MATCH(K19,'DAILY ETo'!$P$6:$P$12,0)))","v":1},0.47987755102040919,"","Tue",11,{"$f":"INDEX('DAILY ETo'!$Q$6:$Q$12,(MATCH(P19,'DAILY ETo'!$P$6:$P$12,0)))","v":1},0.45575510204081759,"","Thu",11,{"$f":"INDEX('DAILY ETo'!$Q$6:$Q$12,(MATCH(U19,'DAILY ETo'!$P$6:$P$12,0)))","v":1},-3.3428571428570364E-2,"Run","Sun",11,{"$f":"INDEX('DAILY ETo'!$Q$6:$Q$12,(MATCH(Z19,'DAILY ETo'!$P$6:$P$12,0)))","v":0},0.44338775510204209,"","Tue",11,{"$f":"INDEX('DAILY ETo'!$Q$6:$Q$12,(MATCH(AE19,'DAILY ETo'!$P$6:$P$12,0)))","v":1},8.3142857142858739E-2,"Run","Fri",11,{"$f":"INDEX('DAILY ETo'!$Q$6:$Q$12,(MATCH(AJ19,'DAILY ETo'!$P$6:$P$12,0)))","v":0},0.56742857142857284,"","Mon",11,{"$f":"INDEX('DAILY ETo'!$Q$6:$Q$12,(MATCH(AO19,'DAILY ETo'!$P$6:$P$12,0)))","v":0},0.29571428571428748,"","Wed",11,{"$f":"INDEX('DAILY ETo'!$Q$6:$Q$12,(MATCH(AT19,'DAILY ETo'!$P$6:$P$12,0)))","v":0},8.7061224489797626E-2,"","Sat",11,{"$f":"INDEX('DAILY ETo'!$Q$6:$Q$12,(MATCH(AY19,'DAILY ETo'!$P$6:$P$12,0)))","v":1},0.16946938775510387,"","Mon",11,{"$f":"INDEX('DAILY ETo'!$Q$6:$Q$12,(MATCH(BD19,'DAILY ETo'!$P$6:$P$12,0)))","v":0},0.51893877551020617,""]
["Thu",12,{"$f":"INDEX('DAILY ETo'!$Q$6:$Q$12,(MATCH(A20,'DAILY ETo'!$P$6:$P$12,0)))","v":1},0.3600000000000001,"","Sun",12,{"$f":"INDEX('DAILY ETo'!$Q$6:$Q$12,(MATCH(F20,'DAILY ETo'!$P$6:$P$12,0)))","v":0},0.21293877551020468,"","Sun",12,{"$f":"INDEX('DAILY ETo'!$Q$6:$Q$12,(MATCH(K20,'DAILY ETo'!$P$6:$P$12,0)))","v":0},0.55187755102040925,"","Wed",12,{"$f":"INDEX('DAILY ETo'!$Q$6:$Q$12,(MATCH(P20,'DAILY ETo'!$P$6:$P$12,0)))","v":0},0.55775510204081757,"","Fri",12,{"$f":"INDEX('DAILY ETo'!$Q$6:$Q$12,(MATCH(U20,'DAILY ETo'!$P$6:$P$12,0)))","v":0},9.8571428571429615E-2,"","Mon",12,{"$f":"INDEX('DAILY ETo'!$Q$6:$Q$12,(MATCH(Z20,'DAILY ETo'!$P$6:$P$12,0)))","v":0},0.59938775510204212,"","Wed",12,{"$f":"INDEX('DAILY ETo'!$Q$6:$Q$12,(MATCH(AE20,'DAILY ETo'!$P$6:$P$12,0)))","v":0},0.25114285714285872,"","Sat",12,{"$f":"INDEX('DAILY ETo'!$Q$6:$Q$12,(MATCH(AJ20,'DAILY ETo'!$P$6:$P$12,0)))","v":1},7.0897959183674919E-2,"Run","Tue",12,{"$f":"INDEX('DAILY ETo'!$Q$6:$Q$12,(MATCH(AO20,'DAILY ETo'!$P$6:$P$12,0)))","v":1},0.40971428571428747,"","Thu",12,{"$f":"INDEX('DAILY ETo'!$Q$6:$Q$12,(MATCH(AT20,'DAILY ETo'!$P$6:$P$12,0)))","v":1},0.16506122448979763,"","Sun",12,{"$f":"INDEX('DAILY ETo'!$Q$6:$Q$12,(MATCH(AY20,'DAILY ETo'!$P$6:$P$12,0)))","v":0},0.21146938775510388,"","Tue",12,{"$f":"INDEX('DAILY ETo'!$Q$6:$Q$12,(MATCH(BD20,'DAILY ETo'!$P$6:$P$12,0)))","v":1},0.53693877551020619,""]
["Fri",13,{"$f":"INDEX('DAILY ETo'!$Q$6:$Q$12,(MATCH(A21,'DAILY ETo'!$P$6:$P$12,0)))","v":0},0.39000000000000012,"","Mon",13,{"$f":"INDEX('DAILY ETo'!$Q$6:$Q$12,(MATCH(F21,'DAILY ETo'!$P$6:$P$12,0)))","v":0},0.26093877551020467,"","Mon",13,{"$f":"INDEX('DAILY ETo'!$Q$6:$Q$12,(MATCH(K21,'DAILY ETo'!$P$6:$P$12,0)))","v":0},0.62387755102040932,"","Thu",13,{"$f":"INDEX('DAILY ETo'!$Q$6:$Q$12,(MATCH(P21,'DAILY ETo'!$P$6:$P$12,0)))","v":1},1.3224489795919614E-2,"Run","Sat",13,{"$f":"INDEX('DAILY ETo'!$Q$6:$Q$12,(MATCH(U21,'DAILY ETo'!$P$6:$P$12,0)))","v":1},0.23057142857142959,"","Tue",13,{"$f":"INDEX('DAILY ETo'!$Q$6:$Q$12,(MATCH(Z21,'DAILY ETo'!$P$6:$P$12,0)))","v":1},0.10885714285714421,"Run","Thu",13,{"$f":"INDEX('DAILY ETo'!$Q$6:$Q$12,(MATCH(AE21,'DAILY ETo'!$P$6:$P$12,0)))","v":1},0.4191428571428587,"","Sun",13,{"$f":"INDEX('DAILY ETo'!$Q$6:$Q$12,(MATCH(AJ21,'DAILY ETo'!$P$6:$P$12,0)))","v":0},0.22089795918367491,"","Wed",13,{"$f":"INDEX('DAILY ETo'!$Q$6:$Q$12,(MATCH(AO21,'DAILY ETo'!$P$6:$P$12,0)))","v":0},0.52371428571428746,"","Fri",13,{"$f":"INDEX('DAILY ETo'!$Q$6:$Q$12,(MATCH(AT21,'DAILY ETo'!$P$6:$P$12,0)))","v":0},0.24306122448979761,"","Mon",13,{"$f":"INDEX('DAILY ETo'!$Q$6:$Q$12,(MATCH(AY21,'DAILY ETo'!$P$6:$P$12,0)))","v":0},0.25346938775510386,"","Wed",13,{"$f":"INDEX('DAILY ETo'!$Q$6:$Q$12,(MATCH(BD21,'DAILY ETo'!$P$6:$P$12,0)))","v":0},0.55493877551020621,""]
["Sat",14,{"$f":"INDEX('DAILY ETo'!$Q$6:$Q$12,(MATCH(A22,'DAILY ETo'!$P$6:$P$12,0)))","v":1},0.42000000000000015,"","Tue",14,{"$f":"INDEX('DAILY ETo'!$Q$6:$Q$12,(MATCH(F22,'DAILY ETo'!$P$6:$P$12,0)))","v":1},0.30893877551020466,"","Tue",14,{"$f":"INDEX('DAILY ETo'!$Q$6:$Q$12,(MATCH(K22,'DAILY ETo'!$P$6:$P$12,0)))","v":1},4.934693877551144E-2,"Run","Fri",14,{"$f":"INDEX('DAILY ETo'!$Q$6:$Q$12,(MATCH(P22,'DAILY ETo'!$P$6:$P$12,0)))","v":0},0.11522448979591961,"","Sun",14,{"$f":"INDEX('DAILY ETo'!$Q$6:$Q$12,(MATCH(U22,'DAILY ETo'!$P$6:$P$12,0)))","v":0},0.36257142857142954,"","Wed",14,{"$f":"INDEX('DAILY ETo'!$Q$6:$Q$12,(MATCH(Z22,'DAILY ETo'!$P$6:$P$12,0)))","v":0},0.26485714285714423,"","Fri",14,{"$f":"INDEX('DAILY ETo'!$Q$6:$Q$12,(MATCH(AE22,'DAILY ETo'!$P$6:$P$12,0)))","v":0},0.58714285714285874,"","Mon",14,{"$f":"INDEX('DAILY ETo'!$Q$6:$Q$12,(MATCH(AJ22,'DAILY ETo'!$P$6:$P$12,0)))","v":0},0.37089795918367491,"","Thu",14,{"$f":"INDEX('DAILY ETo'!$Q$6:$Q$12,(MATCH(AO22,'DAILY ETo'!$P$6:$P$12,0)))","v":1},-8.8163265306104854E-3,"Run","Sat",14,{"$f":"INDEX('DAILY ETo'!$Q$6:$Q$12,(MATCH(AT22,'DAILY ETo'!$P$6:$P$12,0)))","v":1},0.32106122448979763,"","Tue",14,{"$f":"INDEX('DAILY ETo'!$Q$6:$Q$12,(MATCH(AY22,'DAILY ETo'!$P$6:$P$12,0)))","v":1},0.29546938775510384,"","Thu",14,{"$f":"INDEX('DAILY ETo'!$Q$6:$Q$12,(MATCH(BD22,'DAILY ETo'!$P$6:$P$12,0)))","v":1},0.57293877551020622,""]
["Sun",15,{"$f":"INDEX('DAILY ETo'!$Q$6:$Q$12,(MATCH(A23,'DAILY ETo'!$P$6:$P$12,0)))","v":0},0.45000000000000018,"","Wed",15,{"$f":"INDEX('DAILY ETo'!$Q$6:$Q$12,(MATCH(F23,'DAILY ETo'!$P$6:$P$12,0)))","v":0},0.35693877551020464,"","Wed",15,{"$f":"INDEX('DAILY ETo'!$Q$6:$Q$12,(MATCH(K23,'DAILY ETo'!$P$6:$P$12,0)))","v":0},0.12134693877551145,"","Sat",15,{"$f":"INDEX('DAILY ETo'!$Q$6:$Q$12,(MATCH(P23,'DAILY ETo'!$P$6:$P$12,0)))","v":1},0.2172244897959196,"","Mon",15,{"$f":"INDEX('DAILY ETo'!$Q$6:$Q$12,(MATCH(U23,'DAILY ETo'!$P$6:$P$12,0)))","v":0},0.49457142857142955,"","Thu",15,{"$f":"INDEX('DAILY ETo'!$Q$6:$Q$12,(MATCH(Z23,'DAILY ETo'!$P$6:$P$12,0)))","v":1},0.42085714285714426,"","Sat",15,{"$f":"INDEX('DAILY ETo'!$Q$6:$Q$12,(MATCH(AE23,'DAILY ETo'!$P$6:$P$12,0)))","v":1},0.10861224489796073,"Run","Tue",15,{"$f":"INDEX('DAILY ETo'!$Q$6:$Q$12,(MATCH(AJ23,'DAILY ETo'!$P$6:$P$12,0)))","v":1},0.52089795918367487,"","Fri",15,{"$f":"INDEX('DAILY ETo'!$Q$6:$Q$12,(MATCH(AO23,'DAILY ETo'!$P$6:$P$12,0)))","v":0},0.10518367346938952,"","Sun",15,{"$f":"INDEX('DAILY ETo'!$Q$6:$Q$12,(MATCH(AT23,'DAILY ETo'!$P$6:$P$12,0)))","v":0},0.39906122448979764,"","Wed",15,{"$f":"INDEX('DAILY ETo'!$Q$6:$Q$12,(MATCH(AY23,'DAILY ETo'!$P$6:$P$12,0)))","v":0},0.33746938775510382,"","Fri",15,{"$f":"INDEX('DAILY ETo'!$Q$6:$Q$12,(MATCH(BD23,'DAILY ETo'!$P$6:$P$12,0)))","v":0},0.59093877551020624,""]
["Mon",16,{"$f":"INDEX('DAILY ETo'!$Q$6:$Q$12,(MATCH(A24,'DAILY ETo'!$P$6:$P$12,0)))","v":0},0.4800000000000002,"","Thu",16,{"$f":"INDEX('DAILY ETo'!$Q$6:$Q$12,(MATCH(F24,'DAILY ETo'!$P$6:$P$12,0)))","v":1},0.40493877551020463,"","Thu",16,{"$f":"INDEX('DAILY ETo'!$Q$6:$Q$12,(MATCH(K24,'DAILY ETo'!$P$6:$P$12,0)))","v":1},0.19334693877551146,"","Sun",16,{"$f":"INDEX('DAILY ETo'!$Q$6:$Q$12,(MATCH(P24,'DAILY ETo'!$P$6:$P$12,0)))","v":0},0.31922448979591961,"","Tue",16,{"$f":"INDEX('DAILY ETo'!$Q$6:$Q$12,(MATCH(U24,'DAILY ETo'!$P$6:$P$12,0)))","v":1},-1.9959183673468384E-2,"Run","Fri",16,{"$f":"INDEX('DAILY ETo'!$Q$6:$Q$12,(MATCH(Z24,'DAILY ETo'!$P$6:$P$12,0)))","v":0},0.57685714285714429,"","Sun",16,{"$f":"INDEX('DAILY ETo'!$Q$6:$Q$12,(MATCH(AE24,'DAILY ETo'!$P$6:$P$12,0)))","v":0},0.27661224489796071,"","Wed",16,{"$f":"INDEX('DAILY ETo'!$Q$6:$Q$12,(MATCH(AJ24,'DAILY ETo'!$P$6:$P$12,0)))","v":0},0.6708979591836749,"","Sat",16,{"$f":"INDEX('DAILY ETo'!$Q$6:$Q$12,(MATCH(AO24,'DAILY ETo'!$P$6:$P$12,0)))","v":1},0.21918367346938952,"","Mon",16,{"$f":"INDEX('DAILY ETo'!$Q$6:$Q$12,(MATCH(AT24,'DAILY ETo'!$P$6:$P$12,0)))","v":0},0.47706122448979765,"","Thu",16,{"$f":"INDEX('DAILY ETo'!$Q$6:$Q$12,(MATCH(AY24,'DAILY ETo'!$P$6:$P$12,0)))","v":1},0.3794693877551038,"","Sat",16,{"$f":"INDEX('DAILY ETo'!$Q$6:$Q$12,(MATCH(BD24,'DAILY ETo'!$P$6:$P$12,0)))","v":1},0.60893877551020625,""]
["Tue",17,{"$f":"INDEX('DAILY ETo'!$Q$6:$Q$12,(MATCH(A25,'DAILY ETo'!$P$6:$P$12,0)))","v":1},0.51000000000000023,"","Fri",17,{"$f":"INDEX('DAILY ETo'!$Q$6:$Q$12,(MATCH(F25,'DAILY ETo'!$P$6:$P$12,0)))","v":0},0.45293877551020462,"","Fri",17,{"$f":"INDEX('DAILY ETo'!$Q$6:$Q$12,(MATCH(K25,'DAILY ETo'!$P$6:$P$12,0)))","v":0},0.26534693877551147,"","Mon",17,{"$f":"INDEX('DAILY ETo'!$Q$6:$Q$12,(MATCH(P25,'DAILY ETo'!$P$6:$P$12,0)))","v":0},0.42122448979591959,"","Wed",17,{"$f":"INDEX('DAILY ETo'!$Q$6:$Q$12,(MATCH(U25,'DAILY ETo'!$P$6:$P$12,0)))","v":0},0.11204081632653159,"","Sat",17,{"$f":"INDEX('DAILY ETo'!$Q$6:$Q$12,(MATCH(Z25,'DAILY ETo'!$P$6:$P$12,0)))","v":1},8.6326530612246377E-2,"Run","Mon",17,{"$f":"INDEX('DAILY ETo'!$Q$6:$Q$12,(MATCH(AE25,'DAILY ETo'!$P$6:$P$12,0)))","v":0},0.4446122448979607,"","Thu",17,{"$f":"INDEX('DAILY ETo'!$Q$6:$Q$12,(MATCH(AJ25,'DAILY ETo'!$P$6:$P$12,0)))","v":1},0.17436734693877698,"Run","Sun",17,{"$f":"INDEX('DAILY ETo'!$Q$6:$Q$12,(MATCH(AO25,'DAILY ETo'!$P$6:$P$12,0)))","v":0},0.33318367346938954,"","Tue",17,{"$f":"INDEX('DAILY ETo'!$Q$6:$Q$12,(MATCH(AT25,'DAILY ETo'!$P$6:$P$12,0)))","v":1},0.55506122448979767,"","Fri",17,{"$f":"INDEX('DAILY ETo'!$Q$6:$Q$12,(MATCH(AY25,'DAILY ETo'!$P$6:$P$12,0)))","v":0},0.42146938775510379,"","Sun",17,{"$f":"INDEX('DAILY ETo'!$Q$6:$Q$12,(MATCH(BD25,'DAILY ETo'!$P$6:$P$12,0)))","v":0},0.62693877551020627,""]
["Wed",18,{"$f":"INDEX('DAILY ETo'!$Q$6:$Q$12,(MATCH(A26,'DAILY ETo'!$P$6:$P$12,0)))","v":0},0.54000000000000026,"","Sat",18,{"$f":"INDEX('DAILY ETo'!$Q$6:$Q$12,(MATCH(F26,'DAILY ETo'!$P$6:$P$12,0)))","v":1},0.5009387755102046,"","Sat",18,{"$f":"INDEX('DAILY ETo'!$Q$6:$Q$12,(MATCH(K26,'DAILY ETo'!$P$6:$P$12,0)))","v":1},0.33734693877551147,"","Tue",18,{"$f":"INDEX('DAILY ETo'!$Q$6:$Q$12,(MATCH(P26,'DAILY ETo'!$P$6:$P$12,0)))","v":1},0.52322448979591962,"","Thu",18,{"$f":"INDEX('DAILY ETo'!$Q$6:$Q$12,(MATCH(U26,'DAILY ETo'!$P$6:$P$12,0)))","v":1},0.24404081632653157,"","Sun",18,{"$f":"INDEX('DAILY ETo'!$Q$6:$Q$12,(MATCH(Z26,'DAILY ETo'!$P$6:$P$12,0)))","v":0},0.24232653061224638,"","Tue",18,{"$f":"INDEX('DAILY ETo'!$Q$6:$Q$12,(MATCH(AE26,'DAILY ETo'!$P$6:$P$12,0)))","v":1},-3.3918367346937206E-2,"Run","Fri",18,{"$f":"INDEX('DAILY ETo'!$Q$6:$Q$12,(MATCH(AJ26,'DAILY ETo'!$P$6:$P$12,0)))","v":0},0.324367346938777,"","Mon",18,{"$f":"INDEX('DAILY ETo'!$Q$6:$Q$12,(MATCH(AO26,'DAILY ETo'!$P$6:$P$12,0)))","v":0},0.44718367346938953,"","Wed",18,{"$f":"INDEX('DAILY ETo'!$Q$6:$Q$12,(MATCH(AT26,'DAILY ETo'!$P$6:$P$12,0)))","v":0},0.63306122448979762,"","Sat",18,{"$f":"INDEX('DAILY ETo'!$Q$6:$Q$12,(MATCH(AY26,'DAILY ETo'!$P$6:$P$12,0)))","v":1},0.46346938775510377,"","Mon",18,{"$f":"INDEX('DAILY ETo'!$Q$6:$Q$12,(MATCH(BD26,'DAILY ETo'!$P$6:$P$12,0)))","v":0},0.64493877551020629,""]
["Thu",19,{"$f":"INDEX('DAILY ETo'!$Q$6:$Q$12,(MATCH(A27,'DAILY ETo'!$P$6:$P$12,0)))","v":1},0.57000000000000028,"","Sun",19,{"$f":"INDEX('DAILY ETo'!$Q$6:$Q$12,(MATCH(F27,'DAILY ETo'!$P$6:$P$12,0)))","v":0},0.54893877551020465,"","Sun",19,{"$f":"INDEX('DAILY ETo'!$Q$6:$Q$12,(MATCH(K27,'DAILY ETo'!$P$6:$P$12,0)))","v":0},0.40934693877551148,"","Wed",19,{"$f":"INDEX('DAILY ETo'!$Q$6:$Q$12,(MATCH(P27,'DAILY ETo'!$P$6:$P$12,0)))","v":0},0.6252244897959196,"","Fri",19,{"$f":"INDEX('DAILY ETo'!$Q$6:$Q$12,(MATCH(U27,'DAILY ETo'!$P$6:$P$12,0)))","v":0},0.37604081632653152,"","Mon",19,{"$f":"INDEX('DAILY ETo'!$Q$6:$Q$12,(MATCH(Z27,'DAILY ETo'!$P$6:$P$12,0)))","v":0},0.39832653061224638,"","Wed",19,{"$f":"INDEX('DAILY ETo'!$Q$6:$Q$12,(MATCH(AE27,'DAILY ETo'!$P$6:$P$12,0)))","v":0},0.13408163265306278,"","Sat",19,{"$f":"INDEX('DAILY ETo'!$Q$6:$Q$12,(MATCH(AJ27,'DAILY ETo'!$P$6:$P$12,0)))","v":1},0.47436734693877702,"","Tue",19,{"$f":"INDEX('DAILY ETo'!$Q$6:$Q$12,(MATCH(AO27,'DAILY ETo'!$P$6:$P$12,0)))","v":1},0.56118367346938958,"","Thu",19,{"$f":"INDEX('DAILY ETo'!$Q$6:$Q$12,(MATCH(AT27,'DAILY ETo'!$P$6:$P$12,0)))","v":1},6.4530612244899643E-2,"Run","Sun",19,{"$f":"INDEX('DAILY ETo'!$Q$6:$Q$12,(MATCH(AY27,'DAILY ETo'!$P$6:$P$12,0)))","v":0},0.50546938775510375,"","Tue",19,{"$f":"INDEX('DAILY ETo'!$Q$6:$Q$12,(MATCH(BD27,'DAILY ETo'!$P$6:$P$12,0)))","v":1},1.6408163265308362E-2,"Run"]
["Fri",20,{"$f":"INDEX('DAILY ETo'!$Q$6:$Q$12,(MATCH(A28,'DAILY ETo'!$P$6:$P$12,0)))","v":0},0.60000000000000031,"","Mon",20,{"$f":"INDEX('DAILY ETo'!$Q$6:$Q$12,(MATCH(F28,'DAILY ETo'!$P$6:$P$12,0)))","v":0},0.59693877551020469,"","Mon",20,{"$f":"INDEX('DAILY ETo'!$Q$6:$Q$12,(MATCH(K28,'DAILY ETo'!$P$6:$P$12,0)))","v":0},0.48134693877551149,"","Thu",20,{"$f":"INDEX('DAILY ETo'!$Q$6:$Q$12,(MATCH(P28,'DAILY ETo'!$P$6:$P$12,0)))","v":1},8.0693877551021642E-2,"Run","Sat",20,{"$f":"INDEX('DAILY ETo'!$Q$6:$Q$12,(MATCH(U28,'DAILY ETo'!$P$6:$P$12,0)))","v":1},0.50804081632653153,"","Tue",20,{"$f":"INDEX('DAILY ETo'!$Q$6:$Q$12,(MATCH(Z28,'DAILY ETo'!$P$6:$P$12,0)))","v":1},0.55432653061224635,"","Thu",20,{"$f":"INDEX('DAILY ETo'!$Q$6:$Q$12,(MATCH(AE28,'DAILY ETo'!$P$6:$P$12,0)))","v":1},0.30208163265306276,"","Sun",20,{"$f":"INDEX('DAILY ETo'!$Q$6:$Q$12,(MATCH(AJ28,'DAILY ETo'!$P$6:$P$12,0)))","v":0},0.62436734693877705,"","Wed",20,{"$f":"INDEX('DAILY ETo'!$Q$6:$Q$12,(MATCH(AO28,'DAILY ETo'!$P$6:$P$12,0)))","v":0},0.67518367346938957,"","Fri",20,{"$f":"INDEX('DAILY ETo'!$Q$6:$Q$12,(MATCH(AT28,'DAILY ETo'!$P$6:$P$12,0)))","v":0},0.14253061224489966,"","Mon",20,{"$f":"INDEX('DAILY ETo'!$Q$6:$Q$12,(MATCH(AY28,'DAILY ETo'!$P$6:$P$12,0)))","v":0},0.54746938775510379,"","Wed",20,{"$f":"INDEX('DAILY ETo'!$Q$6:$Q$12,(MATCH(BD28,'DAILY ETo'!$P$6:$P$12,0)))","v":0},3.4408163265308364E-2,""]
["Sat",21,{"$f":"INDEX('DAILY ETo'!$Q$6:$Q$12,(MATCH(A29,'DAILY ETo'!$P$6:$P$12,0)))","v":1},0.63000000000000034,"","Tue",21,{"$f":"INDEX('DAILY ETo'!$Q$6:$Q$12,(MATCH(F29,'DAILY ETo'!$P$6:$P$12,0)))","v":1},-1.5918367346932083E-3,"Run","Tue",21,{"$f":"INDEX('DAILY ETo'!$Q$6:$Q$12,(MATCH(K29,'DAILY ETo'!$P$6:$P$12,0)))","v":1},0.55334693877551144,"","Fri",21,{"$f":"INDEX('DAILY ETo'!$Q$6:$Q$12,(MATCH(P29,'DAILY ETo'!$P$6:$P$12,0)))","v":0},0.18269387755102162,"","Sun",21,{"$f":"INDEX('DAILY ETo'!$Q$6:$Q$12,(MATCH(U29,'DAILY ETo'!$P$6:$P$12,0)))","v":0},0.64004081632653154,"","Wed",21,{"$f":"INDEX('DAILY ETo'!$Q$6:$Q$12,(MATCH(Z29,'DAILY ETo'!$P$6:$P$12,0)))","v":0},0.71032653061224638,"","Fri",21,{"$f":"INDEX('DAILY ETo'!$Q$6:$Q$12,(MATCH(AE29,'DAILY ETo'!$P$6:$P$12,0)))","v":0},0.47008163265306274,"","Mon",21,{"$f":"INDEX('DAILY ETo'!$Q$6:$Q$12,(MATCH(AJ29,'DAILY ETo'!$P$6:$P$12,0)))","v":0},0.77436734693877707,"","Thu",21,{"$f":"INDEX('DAILY ETo'!$Q$6:$Q$12,(MATCH(AO29,'DAILY ETo'!$P$6:$P$12,0)))","v":1},0.14265306122449162,"Run","Sat",21,{"$f":"INDEX('DAILY ETo'!$Q$6:$Q$12,(MATCH(AT29,'DAILY ETo'!$P$6:$P$12,0)))","v":1},0.22053061224489967,"","Tue",21,{"$f":"INDEX('DAILY ETo'!$Q$6:$Q$12,(MATCH(AY29,'DAILY ETo'!$P$6:$P$12,0)))","v":1},0.58946938775510382,"","Thu",21,{"$f":"INDEX('DAILY ETo'!$Q$6:$Q$12,(MATCH(BD29,'DAILY ETo'!$P$6:$P$12,0)))","v":1},5.2408163265308366E-2,""]
["Sun",22,{"$f":"INDEX('DAILY ETo'!$Q$6:$Q$12,(MATCH(A30,'DAILY ETo'!$P$6:$P$12,0)))","v":0},0.66000000000000036,"","Wed",22,{"$f":"INDEX('DAILY ETo'!$Q$6:$Q$12,(MATCH(F30,'DAILY ETo'!$P$6:$P$12,0)))","v":0},4.6408163265306793E-2,"","Wed",22,{"$f":"INDEX('DAILY ETo'!$Q$6:$Q$12,(MATCH(K30,'DAILY ETo'!$P$6:$P$12,0)))","v":0},0.62534693877551151,"","Sat",22,{"$f":"INDEX('DAILY ETo'!$Q$6:$Q$12,(MATCH(P30,'DAILY ETo'!$P$6:$P$12,0)))","v":1},0.2846938775510216,"","Mon",22,{"$f":"INDEX('DAILY ETo'!$Q$6:$Q$12,(MATCH(U30,'DAILY ETo'!$P$6:$P$12,0)))","v":0},0.77204081632653154,"","Thu",22,{"$f":"INDEX('DAILY ETo'!$Q$6:$Q$12,(MATCH(Z30,'DAILY ETo'!$P$6:$P$12,0)))","v":1},0.21979591836734846,"Run","Sat",22,{"$f":"INDEX('DAILY ETo'!$Q$6:$Q$12,(MATCH(AE30,'DAILY ETo'!$P$6:$P$12,0)))","v":1},-8.4489795918352151E-3,"Run","Tue",22,{"$f":"INDEX('DAILY ETo'!$Q$6:$Q$12,(MATCH(AJ30,'DAILY ETo'!$P$6:$P$12,0)))","v":1},0.27783673469387915,"Run","Fri",22,{"$f":"INDEX('DAILY ETo'!$Q$6:$Q$12,(MATCH(AO30,'DAILY ETo'!$P$6:$P$12,0)))","v":0},0.25665306122449161,"","Sun",22,{"$f":"INDEX('DAILY ETo'!$Q$6:$Q$12,(MATCH(AT30,'DAILY ETo'!$P$6:$P$12,0)))","v":0},0.29853061224489968,"","Wed",22,{"$f":"INDEX('DAILY ETo'!$Q$6:$Q$12,(MATCH(AY30,'DAILY ETo'!$P$6:$P$12,0)))","v":0},0.63146938775510386,"","Fri",22,{"$f":"INDEX('DAILY ETo'!$Q$6:$Q$12,(MATCH(BD30,'DAILY ETo'!$P$6:$P$12,0)))","v":0},7.0408163265308368E-2,""]
["Mon",23,{"$f":"INDEX('DAILY ETo'!$Q$6:$Q$12,(MATCH(A31,'DAILY ETo'!$P$6:$P$12,0)))","v":0},0.69000000000000039,"","Thu",23,{"$f":"INDEX('DAILY ETo'!$Q$6:$Q$12,(MATCH(F31,'DAILY ETo'!$P$6:$P$12,0)))","v":1},9.4408163265306794E-2,"","Thu",23,{"$f":"INDEX('DAILY ETo'!$Q$6:$Q$12,(MATCH(K31,'DAILY ETo'!$P$6:$P$12,0)))","v":1},5.0816326530613631E-2,"Run","Sun",23,{"$f":"INDEX('DAILY ETo'!$Q$6:$Q$12,(MATCH(P31,'DAILY ETo'!$P$6:$P$12,0)))","v":0},0.38669387755102158,"","Tue",23,{"$f":"INDEX('DAILY ETo'!$Q$6:$Q$12,(MATCH(U31,'DAILY ETo'!$P$6:$P$12,0)))","v":1},0.25751020408163361,"Run","Fri",23,{"$f":"INDEX('DAILY ETo'!$Q$6:$Q$12,(MATCH(Z31,'DAILY ETo'!$P$6:$P$12,0)))","v":0},0.37579591836734849,"","Sun",23,{"$f":"INDEX('DAILY ETo'!$Q$6:$Q$12,(MATCH(AE31,'DAILY ETo'!$P$6:$P$12,0)))","v":0},0.15955102040816477,"","Wed",23,{"$f":"INDEX('DAILY ETo'!$Q$6:$Q$12,(MATCH(AJ31,'DAILY ETo'!$P$6:$P$12,0)))","v":0},0.42783673469387917,"","Sat",23,{"$f":"INDEX('DAILY ETo'!$Q$6:$Q$12,(MATCH(AO31,'DAILY ETo'!$P$6:$P$12,0)))","v":1},0.3706530612244916,"","Mon",23,{"$f":"INDEX('DAILY ETo'!$Q$6:$Q$12,(MATCH(AT31,'DAILY ETo'!$P$6:$P$12,0)))","v":0},0.3765306122448997,"","Thu",23,{"$f":"INDEX('DAILY ETo'!$Q$6:$Q$12,(MATCH(AY31,'DAILY ETo'!$P$6:$P$12,0)))","v":1},2.6938775510205959E-2,"Run","Sat",23,{"$f":"INDEX('DAILY ETo'!$Q$6:$Q$12,(MATCH(BD31,'DAILY ETo'!$P$6:$P$12,0)))","v":1},8.840816326530837E-2,""]
["Tue",24,{"$f":"INDEX('DAILY ETo'!$Q$6:$Q$12,(MATCH(A32,'DAILY ETo'!$P$6:$P$12,0)))","v":1},7.3469387755102478E-2,"Run","Fri",24,{"$f":"INDEX('DAILY ETo'!$Q$6:$Q$12,(MATCH(F32,'DAILY ETo'!$P$6:$P$12,0)))","v":0},0.14240816326530681,"","Fri",24,{"$f":"INDEX('DAILY ETo'!$Q$6:$Q$12,(MATCH(K32,'DAILY ETo'!$P$6:$P$12,0)))","v":0},0.12281632653061364,"","Mon",24,{"$f":"INDEX('DAILY ETo'!$Q$6:$Q$12,(MATCH(P32,'DAILY ETo'!$P$6:$P$12,0)))","v":0},0.48869387755102156,"","Wed",24,{"$f":"INDEX('DAILY ETo'!$Q$6:$Q$12,(MATCH(U32,'DAILY ETo'!$P$6:$P$12,0)))","v":0},0.38951020408163362,"","Sat",24,{"$f":"INDEX('DAILY ETo'!$Q$6:$Q$12,(MATCH(Z32,'DAILY ETo'!$P$6:$P$12,0)))","v":1},0.53179591836734852,"","Mon",24,{"$f":"INDEX('DAILY ETo'!$Q$6:$Q$12,(MATCH(AE32,'DAILY ETo'!$P$6:$P$12,0)))","v":0},0.32755102040816475,"","Thu",24,{"$f":"INDEX('DAILY ETo'!$Q$6:$Q$12,(MATCH(AJ32,'DAILY ETo'!$P$6:$P$12,0)))","v":1},0.57783673469387919,"","Sun",24,{"$f":"INDEX('DAILY ETo'!$Q$6:$Q$12,(MATCH(AO32,'DAILY ETo'!$P$6:$P$12,0)))","v":0},0.48465306122449159,"","Tue",24,{"$f":"INDEX('DAILY ETo'!$Q$6:$Q$12,(MATCH(AT32,'DAILY ETo'!$P$6:$P$12,0)))","v":1},0.45453061224489971,"","Fri",24,{"$f":"INDEX('DAILY ETo'!$Q$6:$Q$12,(MATCH(AY32,'DAILY ETo'!$P$6:$P$12,0)))","v":0},6.8938775510205968E-2,"","Sun",24,{"$f":"INDEX('DAILY ETo'!$Q$6:$Q$12,(MATCH(BD32,'DAILY ETo'!$P$6:$P$12,0)))","v":0},0.10640816326530837,""]
["Wed",25,{"$f":"INDEX('DAILY ETo'!$Q$6:$Q$12,(MATCH(A33,'DAILY ETo'!$P$6:$P$12,0)))","v":0},0.10346938775510248,"","Sat",25,{"$f":"INDEX('DAILY ETo'!$Q$6:$Q$12,(MATCH(F33,'DAILY ETo'!$P$6:$P$12,0)))","v":1},0.1904081632653068,"","Sat",25,{"$f":"INDEX('DAILY ETo'!$Q$6:$Q$12,(MATCH(K33,'DAILY ETo'!$P$6:$P$12,0)))","v":1},0.19481632653061365,"","Tue",25,{"$f":"INDEX('DAILY ETo'!$Q$6:$Q$12,(MATCH(P33,'DAILY ETo'!$P$6:$P$12,0)))","v":1},0.59069387755102154,"","Thu",25,{"$f":"INDEX('DAILY ETo'!$Q$6:$Q$12,(MATCH(U33,'DAILY ETo'!$P$6:$P$12,0)))","v":1},0.52151020408163362,"","Sun",25,{"$f":"INDEX('DAILY ETo'!$Q$6:$Q$12,(MATCH(Z33,'DAILY ETo'!$P$6:$P$12,0)))","v":0},0.68779591836734855,"","Tue",25,{"$f":"INDEX('DAILY ETo'!$Q$6:$Q$12,(MATCH(AE33,'DAILY ETo'!$P$6:$P$12,0)))","v":1},0.49555102040816473,"","Fri",25,{"$f":"INDEX('DAILY ETo'!$Q$6:$Q$12,(MATCH(AJ33,'DAILY ETo'!$P$6:$P$12,0)))","v":0},0.72783673469387922,"","Mon",25,{"$f":"INDEX('DAILY ETo'!$Q$6:$Q$12,(MATCH(AO33,'DAILY ETo'!$P$6:$P$12,0)))","v":0},0.59865306122449158,"","Wed",25,{"$f":"INDEX('DAILY ETo'!$Q$6:$Q$12,(MATCH(AT33,'DAILY ETo'!$P$6:$P$12,0)))","v":0},0.53253061224489973,"","Sat",25,{"$f":"INDEX('DAILY ETo'!$Q$6:$Q$12,(MATCH(AY33,'DAILY ETo'!$P$6:$P$12,0)))","v":1},0.11093877551020598,"","Mon",25,{"$f":"INDEX('DAILY ETo'!$Q$6:$Q$12,(MATCH(BD33,'DAILY ETo'!$P$6:$P$12,0)))","v":0},0.12440816326530837,""]
["Thu",26,{"$f":"INDEX('DAILY ETo'!$Q$6:$Q$12,(MATCH(A34,'DAILY ETo'!$P$6:$P$12,0)))","v":1},0.13346938775510248,"","Sun",26,{"$f":"INDEX('DAILY ETo'!$Q$6:$Q$12,(MATCH(F34,'DAILY ETo'!$P$6:$P$12,0)))","v":0},0.23840816326530678,"","Sun",26,{"$f":"INDEX('DAILY ETo'!$Q$6:$Q$12,(MATCH(K34,'DAILY ETo'!$P$6:$P$12,0)))","v":0},0.26681632653061366,"","Wed",26,{"$f":"INDEX('DAILY ETo'!$Q$6:$Q$12,(MATCH(P34,'DAILY ETo'!$P$6:$P$12,0)))","v":0},0.69269387755102152,"","Fri",26,{"$f":"INDEX('DAILY ETo'!$Q$6:$Q$12,(MATCH(U34,'DAILY ETo'!$P$6:$P$12,0)))","v":0},0.65351020408163363,"","Mon",26,{"$f":"INDEX('DAILY ETo'!$Q$6:$Q$12,(MATCH(Z34,'DAILY ETo'!$P$6:$P$12,0)))","v":0},0.84379591836734857,"","Wed",26,{"$f":"INDEX('DAILY ETo'!$Q$6:$Q$12,(MATCH(AE34,'DAILY ETo'!$P$6:$P$12,0)))","v":0},0.66355102040816472,"","Sat",26,{"$f":"INDEX('DAILY ETo'!$Q$6:$Q$12,(MATCH(AJ34,'DAILY ETo'!$P$6:$P$12,0)))","v":1},0.2313061224489813,"Run","Tue",26,{"$f":"INDEX('DAILY ETo'!$Q$6:$Q$12,(MATCH(AO34,'DAILY ETo'!$P$6:$P$12,0)))","v":1},6.6122448979593629E-2,"Run","Thu",26,{"$f":"INDEX('DAILY ETo'!$Q$6:$Q$12,(MATCH(AT34,'DAILY ETo'!$P$6:$P$12,0)))","v":1},0.61053061224489968,"","Sun",26,{"$f":"INDEX('DAILY ETo'!$Q$6:$Q$12,(MATCH(AY34,'DAILY ETo'!$P$6:$P$12,0)))","v":0},0.15293877551020599,"","Tue",26,{"$f":"INDEX('DAILY ETo'!$Q$6:$Q$12,(MATCH(BD34,'DAILY ETo'!$P$6:$P$12,0)))","v":1},0.14240816326530836,""]
["Fri",27,{"$f":"INDEX('DAILY ETo'!$Q$6:$Q$12,(MATCH(A35,'DAILY ETo'!$P$6:$P$12,0)))","v":0},0.16346938775510247,"","Mon",27,{"$f":"INDEX('DAILY ETo'!$Q$6:$Q$12,(MATCH(F35,'DAILY ETo'!$P$6:$P$12,0)))","v":0},0.28640816326530677,"","Mon",27,{"$f":"INDEX('DAILY ETo'!$Q$6:$Q$12,(MATCH(K35,'DAILY ETo'!$P$6:$P$12,0)))","v":0},0.33881632653061367,"","Thu",27,{"$f":"INDEX('DAILY ETo'!$Q$6:$Q$12,(MATCH(P35,'DAILY ETo'!$P$6:$P$12,0)))","v":1},0.14816326530612356,"Run","Sat",27,{"$f":"INDEX('DAILY ETo'!$Q$6:$Q$12,(MATCH(U35,'DAILY ETo'!$P$6:$P$12,0)))","v":1},0.13897959183673569,"Run","Tue",27,{"$f":"INDEX('DAILY ETo'!$Q$6:$Q$12,(MATCH(Z35,'DAILY ETo'!$P$6:$P$12,0)))","v":1},0.35326530612245066,"Run","Thu",27,{"$f":"INDEX('DAILY ETo'!$Q$6:$Q$12,(MATCH(AE35,'DAILY ETo'!$P$6:$P$12,0)))","v":1},0.1850204081632667,"Run","Sun",27,{"$f":"INDEX('DAILY ETo'!$Q$6:$Q$12,(MATCH(AJ35,'DAILY ETo'!$P$6:$P$12,0)))","v":0},0.38130612244898132,"","Wed",27,{"$f":"INDEX('DAILY ETo'!$Q$6:$Q$12,(MATCH(AO35,'DAILY ETo'!$P$6:$P$12,0)))","v":0},0.18012244897959362,"","Fri",27,{"$f":"INDEX('DAILY ETo'!$Q$6:$Q$12,(MATCH(AT35,'DAILY ETo'!$P$6:$P$12,0)))","v":0},0.68853061224489964,"","Mon",27,{"$f":"INDEX('DAILY ETo'!$Q$6:$Q$12,(MATCH(AY35,'DAILY ETo'!$P$6:$P$12,0)))","v":0},0.194938775510206,"","Wed",27,{"$f":"INDEX('DAILY ETo'!$Q$6:$Q$12,(MATCH(BD35,'DAILY ETo'!$P$6:$P$12,0)))","v":0},0.16040816326530835,""]
["Sat",28,{"$f":"INDEX('DAILY ETo'!$Q$6:$Q$12,(MATCH(A36,'DAILY ETo'!$P$6:$P$12,0)))","v":1},0.19346938775510247,"","Tue",28,{"$f":"INDEX('DAILY ETo'!$Q$6:$Q$12,(MATCH(F36,'DAILY ETo'!$P$6:$P$12,0)))","v":1},0.33440816326530676,"","Tue",28,{"$f":"INDEX('DAILY ETo'!$Q$6:$Q$12,(MATCH(K36,'DAILY ETo'!$P$6:$P$12,0)))","v":1},0.41081632653061367,"","Fri",28,{"$f":"INDEX('DAILY ETo'!$Q$6:$Q$12,(MATCH(P36,'DAILY ETo'!$P$6:$P$12,0)))","v":0},0.25016326530612354,"","Sun",28,{"$f":"INDEX('DAILY ETo'!$Q$6:$Q$12,(MATCH(U36,'DAILY ETo'!$P$6:$P$12,0)))","v":0},0.2709795918367357,"","Wed",28,{"$f":"INDEX('DAILY ETo'!$Q$6:$Q$12,(MATCH(Z36,'DAILY ETo'!$P$6:$P$12,0)))","v":0},0.50926530612245069,"","Fri",28,{"$f":"INDEX('DAILY ETo'!$Q$6:$Q$12,(MATCH(AE36,'DAILY ETo'!$P$6:$P$12,0)))","v":0},0.35302040816326669,"","Mon",28,{"$f":"INDEX('DAILY ETo'!$Q$6:$Q$12,(MATCH(AJ36,'DAILY ETo'!$P$6:$P$12,0)))","v":0},0.53130612244898134,"","Thu",28,{"$f":"INDEX('DAILY ETo'!$Q$6:$Q$12,(MATCH(AO36,'DAILY ETo'!$P$6:$P$12,0)))","v":1},0.29412244897959361,"","Sat",28,{"$f":"INDEX('DAILY ETo'!$Q$6:$Q$12,(MATCH(AT36,'DAILY ETo'!$P$6:$P$12,0)))","v":1},0.12000000000000166,"Run","Tue",28,{"$f":"INDEX('DAILY ETo'!$Q$6:$Q$12,(MATCH(AY36,'DAILY ETo'!$P$6:$P$12,0)))","v":1},0.23693877551020601,"","Thu",28,{"$f":"INDEX('DAILY ETo'!$Q$6:$Q$12,(MATCH(BD36,'DAILY ETo'!$P$6:$P$12,0)))","v":1},0.17840816326530834,""]
["Sun",29,{"$f":"INDEX('DAILY ETo'!$Q$6:$Q$12,(MATCH(A37,'DAILY ETo'!$P$6:$P$12,0)))","v":0},0.22346938775510247,"",{"$f":"IF(OR(MOD(Irrig_Year,400)=0,AND(MOD(Irrig_Year,4)=0,MOD(Irrig_Year,100)<>0)),VLOOKUP(WEEKDAY(DATE(CalendarYear,2,B37)),DayOfWeek,2), \"\")","v":""},{"$f":"IF(OR(MOD(Irrig_Year,400)=0,AND(MOD(Irrig_Year,4)=0,MOD(Irrig_Year,100)<>0)),VALUE(29),\"\")","v":""},{"$f":"INDEX('DAILY ETo'!$Q$6:$Q$12,(MATCH(F37,'DAILY ETo'!$P$6:$P$12,0)))","v":{"$error":"#N/A"}},0.38240816326530674,"","Wed",29,{"$f":"INDEX('DAILY ETo'!$Q$6:$Q$12,(MATCH(K37,'DAILY ETo'!$P$6:$P$12,0)))","v":0},0.48281632653061368,"","Sat",29,{"$f":"INDEX('DAILY ETo'!$Q$6:$Q$12,(MATCH(P37,'DAILY ETo'!$P$6:$P$12,0)))","v":1},0.35216326530612352,"","Mon",29,{"$f":"INDEX('DAILY ETo'!$Q$6:$Q$12,(MATCH(U37,'DAILY ETo'!$P$6:$P$12,0)))","v":0},0.40297959183673571,"","Thu",29,{"$f":"INDEX('DAILY ETo'!$Q$6:$Q$12,(MATCH(Z37,'DAILY ETo'!$P$6:$P$12,0)))","v":1},1.8734693877552777E-2,"Run","Sat",29,{"$f":"INDEX('DAILY ETo'!$Q$6:$Q$12,(MATCH(AE37,'DAILY ETo'!$P$6:$P$12,0)))","v":1},0.52102040816326667,"","Tue",29,{"$f":"INDEX('DAILY ETo'!$Q$6:$Q$12,(MATCH(AJ37,'DAILY ETo'!$P$6:$P$12,0)))","v":1},3.4775510204083426E-2,"Run","Fri",29,{"$f":"INDEX('DAILY ETo'!$Q$6:$Q$12,(MATCH(AO37,'DAILY ETo'!$P$6:$P$12,0)))","v":0},0.4081224489795936,"","Sun",29,{"$f":"INDEX('DAILY ETo'!$Q$6:$Q$12,(MATCH(AT37,'DAILY ETo'!$P$6:$P$12,0)))","v":0},0.19800000000000167,"","Wed",29,{"$f":"INDEX('DAILY ETo'!$Q$6:$Q$12,(MATCH(AY37,'DAILY ETo'!$P$6:$P$12,0)))","v":0},0.27893877551020602,"","Fri",29,{"$f":"INDEX('DAILY ETo'!$Q$6:$Q$12,(MATCH(BD37,'DAILY ETo'!$P$6:$P$12,0)))","v":0},0.19640816326530833,""]
["Mon",30,{"$f":"INDEX('DAILY ETo'!$Q$6:$Q$12,(MATCH(A38,'DAILY ETo'!$P$6:$P$12,0)))","v":0},0.25346938775510247,"",null,null,null,null,null,"Thu",30,{"$f":"INDEX('DAILY ETo'!$Q$6:$Q$12,(MATCH(K38,'DAILY ETo'!$P$6:$P$12,0)))","v":1},0.55481632653061363,"","Sun",30,{"$f":"INDEX('DAILY ETo'!$Q$6:$Q$12,(MATCH(P38,'DAILY ETo'!$P$6:$P$12,0)))","v":0},0.4541632653061235,"","Tue",30,{"$f":"INDEX('DAILY ETo'!$Q$6:$Q$12,(MATCH(U38,'DAILY ETo'!$P$6:$P$12,0)))","v":1},0.53497959183673571,"","Fri",30,{"$f":"INDEX('DAILY ETo'!$Q$6:$Q$12,(MATCH(Z38,'DAILY ETo'!$P$6:$P$12,0)))","v":0},0.17473469387755278,"","Sun",30,{"$f":"INDEX('DAILY ETo'!$Q$6:$Q$12,(MATCH(AE38,'DAILY ETo'!$P$6:$P$12,0)))","v":0},0.68902040816326671,"","Wed",30,{"$f":"INDEX('DAILY ETo'!$Q$6:$Q$12,(MATCH(AJ38,'DAILY ETo'!$P$6:$P$12,0)))","v":0},0.18477551020408342,"","Sat",30,{"$f":"INDEX('DAILY ETo'!$Q$6:$Q$12,(MATCH(AO38,'DAILY ETo'!$P$6:$P$12,0)))","v":1},0.52212244897959359,"","Mon",30,{"$f":"INDEX('DAILY ETo'!$Q$6:$Q$12,(MATCH(AT38,'DAILY ETo'!$P$6:$P$12,0)))","v":0},0.27600000000000169,"","Thu",30,{"$f":"INDEX('DAILY ETo'!$Q$6:$Q$12,(MATCH(AY38,'DAILY ETo'!$P$6:$P$12,0)))","v":1},0.320938775510206,"","Sat",30,{"$f":"INDEX('DAILY ETo'!$Q$6:$Q$12,(MATCH(BD38,'DAILY ETo'!$P$6:$P$12,0)))","v":1},0.21440816326530832,""]
["Tue",31,{"$f":"INDEX('DAILY ETo'!$Q$6:$Q$12,(MATCH(A39,'DAILY ETo'!$P$6:$P$12,0)))","v":1},0.28346938775510244,"",null,null,null,null,null,"Fri",31,{"$f":"INDEX('DAILY ETo'!$Q$6:$Q$12,(MATCH(K39,'DAILY ETo'!$P$6:$P$12,0)))","v":0},0.6268163265306137,"",null,null,null,null,null,"Wed",31,{"$f":"INDEX('DAILY ETo'!$Q$6:$Q$12,(MATCH(U39,'DAILY ETo'!$P$6:$P$12,0)))","v":0},0.66697959183673572,"",null,null,null,null,null,"Mon",31,{"$f":"INDEX('DAILY ETo'!$Q$6:$Q$12,(MATCH(AE39,'DAILY ETo'!$P$6:$P$12,0)))","v":0},0.85702040816326663,"","Thu",31,{"$f":"INDEX('DAILY ETo'!$Q$6:$Q$12,(MATCH(AJ39,'DAILY ETo'!$P$6:$P$12,0)))","v":1},0.33477551020408342,"",null,null,null,null,null,"Tue",31,{"$f":"INDEX('DAILY ETo'!$Q$6:$Q$12,(MATCH(AT39,'DAILY ETo'!$P$6:$P$12,0)))","v":1},0.3540000000000017,"",null,null,null,null,null,"Sun",31,{"$f":"INDEX('DAILY ETo'!$Q$6:$Q$12,(MATCH(BD39,'DAILY ETo'!$P$6:$P$12,0)))","v":0},0.2324081632653083,""]