{"text_format":"1","workbook":"xlsx","n_sheets":13,"sheets":["Instr Refs Auths","Irrigation System Information ","ETo, Soil, C.C., Irr Info.","Catch Can Field Worksheet","drop down list menus","Sheet5","Irrig Summary","Irrig Calendar","ETo Zones Map","SOIL INFORMATION","DU CALCS \"mL.\"","DAILY ETo","Irrig Sched"],"not_rendered":{"charts":0,"images":10,"macros":1,"external_links":0,"defined_names":61,"comments":1,"pivot_tables":0},"unopened":[],"bounds":{"document_bytes":16777216,"sheet_cells":100000,"rows_first":2000,"rows_last":500,"rows_between":2000,"halvings":0,"cell_chars":16384,"cell_head_chars":4096},"cells_cut":0,"cells_raw":0,"read":"whole","date_system":"1900"}

{"sheet":"Instr Refs Auths","index":0,"n_rows":67,"n_cols":2,"rows_kept":67,"cut":false,"hidden":false,"merged":[[15,0,15,5],[11,0,11,5],[12,0,12,5],[8,0,8,5],[7,0,7,5],[9,0,9,5],[10,0,10,5]]}
[]
[]
[]
[]
[]
["Brief instructions"]
{"$rows_left_out":62}
{"sheet":"Irrigation System Information ","index":1,"n_rows":30,"n_cols":7,"rows_kept":30,"cut":false,"hidden":false,"merged":[[30,0,30,2],[31,0,31,2],[32,0,32,2],[33,0,33,2],[34,0,34,2],[6,1,6,2],[7,1,7,2],[6,5,6,6],[10,1,10,2],[11,1,11,2],[10,5,10,6],[22,1,22,2],[23,1,23,2],[22,5,22,6],[23,5,23,6],[14,1,14,2],[15,1,15,2],[14,5,14,6],[15,5,15,6],[18,1,18,2],[19,1,19,2],[18,5,18,6],[19,5,19,6]]}
[]
[]
["Irrigation system Information"]
["Record irrigation system zone information"]
[]
[]
{"$rows_left_out":25}
{"sheet":"ETo, Soil, C.C., Irr Info.","index":2,"n_rows":36,"n_cols":10,"rows_kept":36,"cut":false,"hidden":false,"merged":[[25,9,25,10],[21,9,24,10],[20,4,24,6],[23,2,23,3],[19,0,22,1],[23,0,24,1],[10,2,10,3],[5,0,5,1],[4,0,4,1],[1,0,1,11],[4,4,7,11],[4,2,4,3],[14,0,14,1],[15,2,15,3],[19,2,19,3],[14,6,14,7],[14,2,14,3],[15,4,15,5],[15,6,15,7],[16,4,19,5],[14,4,14,5]]}
["ETo Zone, Soil Texture, and Catch Can Type Worksheet "]
["Determine values for each of the sections below and enter values into the fields provided.    \nNote:  fields highlighted in  green must be filled out in order for other calculations in the spread sheet to work properly"]
["ETo Zone"]
[]
["Location: ",null,"Davis",null,"Find the ETo zone of your location on the ETo Zones Map tab of this worksheet.  Then, select the zone number from the drop down list (to the left of this text).  Enter the name of the location in the space provided."]
["ETo Zone: ",null,14]
{"$rows_left_out":31}
{"sheet":"Catch Can Field Worksheet","index":3,"n_rows":23,"n_cols":12,"rows_kept":23,"cut":false,"hidden":false,"merged":[[21,9,22,11],[17,9,18,11],[19,9,19,11],[1,0,1,11],[7,5,8,10],[5,9,6,11],[12,9,15,11]]}
["Catch Can Field Worksheet "]
["Determine values for each of the sections below and enter values into the fields provided.    \nNote:  fields highlighted in  green must be filled out in order for other calculations in the spread sheet to work properly ."]
[null,null,null,"Valve turned on: ","Manually / Controller",null,null,null,null,null,"Wind(mph):"]
[null,null,null,"Valve turned on: ",null,"          :"," am / pm",null,null,null,"Number of catch cans:",{"$f":"COUNT(B13:B22)+COUNT(D13:D22)+COUNT(F13:F22)+COUNT(H13:H22)","v":40}]
[null,null,null,"Valve turned off: ",null,"          :"," am / pm",null,null,null,"Zone KL or KS:",0.6]
[null,null,null,"Actual Run time:  ",null,6," minutes",null,null,"(Landscape coefficient, KL, \nor species coefficient, KS)"]
{"$rows_left_out":18}
{"sheet":"drop down list menus","index":4,"n_rows":45,"n_cols":19,"rows_kept":45,"cut":false,"hidden":true,"merged":[]}
[null,null,"Inches",null,null,null,null,null,null,null,null,null,null,null,null,"Used for Ranking",null,null,"Used for Ranking"]
["Controller",null,"ml",null,"Yes",null,"Very Good",null,null,null,null,"Annual ryegrass",null,null,null,{"$f":"IF(#REF!<>\"\",#REF!+#REF!/1000,\"\")","v":{"$error":"#REF!"}},null,null,{"$f":"IF(#REF!<>\"\",#REF!+#REF!/1000,\"\")","v":{"$error":"#REF!"}}]
["Manually",null,"Ounces",null,"No",null,"Good",null,null,null,null,"Bermudagrass",null,null,null,{"$f":"IF(#REF!<>\"\",#REF!+#REF!/1000,\"\")","v":{"$error":"#REF!"}},null,null,{"$f":"IF(#REF!<>\"\",#REF!+#REF!/1000,\"\")","v":{"$error":"#REF!"}}]
[null,null,"cm",null,null,null,"Average",null,null,null,null,"Kentucky bluegrass",null,null,null,{"$f":"IF(#REF!<>\"\",#REF!+#REF!/1000,\"\")","v":{"$error":"#REF!"}},null,null,{"$f":"IF(#REF!<>\"\",#REF!+#REF!/1000,\"\")","v":{"$error":"#REF!"}}]
[null,null,null,null,null,null,"Bad",null,null,null,null,"Kikuyugrass",null,null,null,{"$f":"IF(#REF!<>\"\",#REF!+#REF!/1000,\"\")","v":{"$error":"#REF!"}},null,null,{"$f":"IF(#REF!<>\"\",#REF!+#REF!/1000,\"\")","v":{"$error":"#REF!"}}]
[null,null,null,null,null,null,"Very bad",null,null,null,null,"Perennial ryegrass ",null,null,null,{"$f":"IF(#REF!<>\"\",#REF!+#REF!/1000,\"\")","v":{"$error":"#REF!"}},null,null,{"$f":"IF(#REF!<>\"\",#REF!+#REF!/1000,\"\")","v":{"$error":"#REF!"}}]
{"$rows_left_out":40}
{"sheet":"Sheet5","index":5,"n_rows":0,"n_cols":0,"rows_kept":0,"cut":false,"hidden":true,"merged":[]}

{"sheet":"Irrig Summary","index":6,"n_rows":31,"n_cols":8,"rows_kept":31,"cut":false,"hidden":false,"merged":[[11,7,11,8],[17,4,17,5],[24,1,24,2],[23,4,24,8],[17,1,17,2]]}
[]
[]
[]
[]
[]
["Irrigation Summary"]
{"$rows_left_out":26}
{"sheet":"Irrig Calendar","index":7,"n_rows":45,"n_cols":28,"rows_kept":45,"cut":false,"hidden":false,"merged":[[31,21,31,27],[1,21,1,27],[31,0,31,6],[31,7,31,13],[16,21,16,27],[1,0,1,6],[16,0,16,6],[31,14,31,20],[1,7,1,13],[16,7,16,13],[16,14,16,20],[1,14,1,20]]}
[null,null,{"$f":"CONCATENATE(\"Irrigation schedule for  zone: \",'Irrigation System Information '!B7,\".\")","v":"Irrigation schedule for  zone: Test zone 12."},null,null,null,null,null,null,{"$f":"CONCATENATE(\"Irrigation schedule for  zone: \",'Irrigation System Information '!B7,\".\")","v":"Irrigation schedule for  zone: Test zone 12."},null,null,null,null,null,null,{"$f":"CONCATENATE(\"Irrigation schedule for  zone: \",'Irrigation System Information '!B7,\".\")","v":"Irrigation schedule for  zone: Test zone 12."},null,null,null,null,null,null,{"$f":"CONCATENATE(\"Irrigation schedule for  zone: \",'Irrigation System Information '!B7,\".\")","v":"Irrigation schedule for  zone: Test zone 12."}]
[{"$f":"CONCATENATE(\"January \",Irrig_Year)","v":"January 2017"},null,null,null,null,null,null,{"$f":"CONCATENATE(\"April \",Irrig_Year)","v":"April 2017"},null,null,null,null,null,null,{"$f":"CONCATENATE(\"July \",Irrig_Year)","v":"July 2017"},null,null,null,null,null,null,{"$f":"CONCATENATE(\"October \",Irrig_Year)","v":"October 2017"}]
["SUNDAY","MONDAY","TUESDAY","WEDNESDAY","THURSDAY","FRIDAY","SATURDAY","SUNDAY","MONDAY","TUESDAY","WEDNESDAY","THURSDAY","FRIDAY","SATURDAY","SUNDAY","MONDAY","TUESDAY","WEDNESDAY","THURSDAY","FRIDAY","SATURDAY","SUNDAY","MONDAY","TUESDAY","WEDNESDAY","THURSDAY","FRIDAY","SATURDAY"]
[{"$f":"IF(AND(YEAR(JanOffset+1)=CalendarYear,MONTH(JanOffset+1)=1),DAY(JanOffset+1),\"\")","v":"1900-01-01"},{"$f":"IF(AND(YEAR(JanOffset+21)=CalendarYear,MONTH(JanOffset+2)=1),DAY(JanOffset+2),\"\")","v":"1900-01-02"},{"$f":"IF(AND(YEAR(JanOffset+3)=CalendarYear,MONTH(JanOffset+3)=1),DAY(JanOffset+3),\"\")","v":"1900-01-03"},{"$f":"IF(AND(YEAR(JanOffset+4)=CalendarYear,MONTH(JanOffset+4)=1),DAY(JanOffset+4),\"\")","v":"1900-01-04"},{"$f":"IF(AND(YEAR(JanOffset+5)=CalendarYear,MONTH(JanOffset+5)=1),DAY(JanOffset+5),\"\")","v":"1900-01-05"},{"$f":"IF(AND(YEAR(JanOffset+6)=CalendarYear,MONTH(JanOffset+6)=1),DAY(JanOffset+6),\"\")","v":"1900-01-06"},{"$f":"IF(AND(YEAR(JanOffset+7)=CalendarYear,MONTH(JanOffset+7)=1),DAY(JanOffset+7),\"\")","v":"1900-01-07"},{"$f":"IF(AND(YEAR(AprOffset+1)=CalendarYear,MONTH(AprOffset+1)=4),DAY(AprOffset+1),\"\")","v":""},{"$f":"IF(AND(YEAR(AprOffset+2)=CalendarYear,MONTH(AprOffset+2)=4),DAY(AprOffset+2),\"\")","v":""},{"$f":"IF(AND(YEAR(AprOffset+3)=CalendarYear,MONTH(AprOffset+3)=4),DAY(AprOffset+3),\"\")","v":""},{"$f":"IF(AND(YEAR(AprOffset+4)=CalendarYear,MONTH(AprOffset+4)=4),DAY(AprOffset+4),\"\")","v":""},{"$f":"IF(AND(YEAR(AprOffset+5)=CalendarYear,MONTH(AprOffset+5)=4),DAY(AprOffset+5),\"\")","v":""},{"$f":"IF(AND(YEAR(AprOffset+6)=CalendarYear,MONTH(AprOffset+6)=4),DAY(AprOffset+6),\"\")","v":""},{"$f":"IF(AND(YEAR(AprOffset+7)=CalendarYear,MONTH(AprOffset+7)=4),DAY(AprOffset+7),\"\")","v":"1900-01-01"},{"$f":"IF(AND(YEAR(JulOffset+1)=CalendarYear,MONTH(JulOffset+1)=7),DAY(JulOffset+1),\"\")","v":""},{"$f":"IF(AND(YEAR(JulOffset+2)=CalendarYear,MONTH(JulOffset+2)=7),DAY(JulOffset+2),\"\")","v":""},{"$f":"IF(AND(YEAR(JulOffset+3)=CalendarYear,MONTH(JulOffset+3)=7),DAY(JulOffset+3),\"\")","v":""},{"$f":"IF(AND(YEAR(JulOffset+4)=CalendarYear,MONTH(JulOffset+4)=7),DAY(JulOffset+4),\"\")","v":""},{"$f":"IF(AND(YEAR(JulOffset+5)=CalendarYear,MONTH(JulOffset+5)=7),DAY(JulOffset+5),\"\")","v":""},{"$f":"IF(AND(YEAR(JulOffset+6)=CalendarYear,MONTH(JulOffset+6)=7),DAY(JulOffset+6),\"\")","v":""},{"$f":"IF(AND(YEAR(JulOffset+7)=CalendarYear,MONTH(JulOffset+7)=7),DAY(JulOffset+7),\"\")","v":"1900-01-01"},{"$f":"IF(AND(YEAR(OctOffset+1)=CalendarYear,MONTH(OctOffset+1)=10),DAY(OctOffset+1),\"\")","v":"1900-01-01"},{"$f":"IF(AND(YEAR(OctOffset+2)=CalendarYear,MONTH(OctOffset+2)=10),DAY(OctOffset+2),\"\")","v":"1900-01-02"},{"$f":"IF(AND(YEAR(OctOffset+3)=CalendarYear,MONTH(OctOffset+3)=10),DAY(OctOffset+3),\"\")","v":"1900-01-03"},{"$f":"IF(AND(YEAR(OctOffset+4)=CalendarYear,MONTH(OctOffset+4)=10),DAY(OctOffset+4),\"\")","v":"1900-01-04"},{"$f":"IF(AND(YEAR(OctOffset+5)=CalendarYear,MONTH(OctOffset+5)=10),DAY(OctOffset+5),\"\")","v":"1900-01-05"},{"$f":"IF(AND(YEAR(OctOffset+6)=CalendarYear,MONTH(OctOffset+6)=10),DAY(OctOffset+6),\"\")","v":"1900-01-06"},{"$f":"IF(AND(YEAR(OctOffset+7)=CalendarYear,MONTH(OctOffset+7)=10),DAY(OctOffset+7),\"\")","v":"1900-01-07"}]
[{"$f":"IF(A4=\"\",\"\",INDEX('Irrig Sched'!$E$9:$E$39,MATCH(A4,'Irrig Sched'!$B$9:$B$39,0)))","v":""},{"$f":"IF(B4=\"\",\"\",INDEX('Irrig Sched'!$E$9:$E$39,MATCH(B4,'Irrig Sched'!$B$9:$B$39,0)))","v":""},{"$f":"IF(C4=\"\",\"\",INDEX('Irrig Sched'!$E$9:$E$39,MATCH(C4,'Irrig Sched'!$B$9:$B$39,0)))","v":""},{"$f":"IF(D4=\"\",\"\",INDEX('Irrig Sched'!$E$9:$E$39,MATCH(D4,'Irrig Sched'!$B$9:$B$39,0)))","v":""},{"$f":"IF(E4=\"\",\"\",INDEX('Irrig Sched'!$E$9:$E$39,MATCH(E4,'Irrig Sched'!$B$9:$B$39,0)))","v":""},{"$f":"IF(F4=\"\",\"\",INDEX('Irrig Sched'!$E$9:$E$39,MATCH(F4,'Irrig Sched'!$B$9:$B$39,0)))","v":""},{"$f":"IF(G4=\"\",\"\",INDEX('Irrig Sched'!$E$9:$E$39,MATCH(G4,'Irrig Sched'!$B$9:$B$39,0)))","v":""},{"$f":"IF(H4=\"\",\"\",INDEX('Irrig Sched'!$T$9:$T$39,MATCH(H4,'Irrig Sched'!$Q$9:$Q$39,0)))","v":""},{"$f":"IF(I4=\"\",\"\",INDEX('Irrig Sched'!$T$9:$T$39,MATCH(I4,'Irrig Sched'!$Q$9:$Q$39,0)))","v":""},{"$f":"IF(J4=\"\",\"\",INDEX('Irrig Sched'!$T$9:$T$39,MATCH(J4,'Irrig Sched'!$Q$9:$Q$39,0)))","v":""},{"$f":"IF(K4=\"\",\"\",INDEX('Irrig Sched'!$T$9:$T$39,MATCH(K4,'Irrig Sched'!$Q$9:$Q$39,0)))","v":""},{"$f":"IF(L4=\"\",\"\",INDEX('Irrig Sched'!$T$9:$T$39,MATCH(L4,'Irrig Sched'!$Q$9:$Q$39,0)))","v":""},{"$f":"IF(M4=\"\",\"\",INDEX('Irrig Sched'!$T$9:$T$39,MATCH(M4,'Irrig Sched'!$Q$9:$Q$39,0)))","v":""},{"$f":"IF(N4=\"\",\"\",INDEX('Irrig Sched'!$T$9:$T$39,MATCH(N4,'Irrig Sched'!$Q$9:$Q$39,0)))","v":"Run"},{"$f":"IF(O4=\"\",\"\",INDEX('Irrig Sched'!$AI$9:$AI$39,MATCH(O4,'Irrig Sched'!$AF$9:$AF$39,0)))","v":""},{"$f":"IF(P4=\"\",\"\",INDEX('Irrig Sched'!$AI$9:$AI$39,MATCH(P4,'Irrig Sched'!$AF$9:$AF$39,0)))","v":""},{"$f":"IF(Q4=\"\",\"\",INDEX('Irrig Sched'!$AI$9:$AI$39,MATCH(Q4,'Irrig Sched'!$AF$9:$AF$39,0)))","v":""},{"$f":"IF(R4=\"\",\"\",INDEX('Irrig Sched'!$AI$9:$AI$39,MATCH(R4,'Irrig Sched'!$AF$9:$AF$39,0)))","v":""},{"$f":"IF(S4=\"\",\"\",INDEX('Irrig Sched'!$AI$9:$AI$39,MATCH(S4,'Irrig Sched'!$AF$9:$AF$39,0)))","v":""},{"$f":"IF(T4=\"\",\"\",INDEX('Irrig Sched'!$AI$9:$AI$39,MATCH(T4,'Irrig Sched'!$AF$9:$AF$39,0)))","v":""},{"$f":"IF(U4=\"\",\"\",INDEX('Irrig Sched'!$AI$9:$AI$39,MATCH(U4,'Irrig Sched'!$AF$9:$AF$39,0)))","v":""},{"$f":"IF(V4=\"\",\"\",INDEX('Irrig Sched'!$AX$9:$AX$39,MATCH(V4,'Irrig Sched'!$AU$9:$AU$39,0)))","v":""},{"$f":"IF(W4=\"\",\"\",INDEX('Irrig Sched'!$AX$9:$AX$39,MATCH(W4,'Irrig Sched'!$AU$9:$AU$39,0)))","v":""},{"$f":"IF(X4=\"\",\"\",INDEX('Irrig Sched'!$AX$9:$AX$39,MATCH(X4,'Irrig Sched'!$AU$9:$AU$39,0)))","v":"Run"},{"$f":"IF(Y4=\"\",\"\",INDEX('Irrig Sched'!$AX$9:$AX$39,MATCH(Y4,'Irrig Sched'!$AU$9:$AU$39,0)))","v":""},{"$f":"IF(Z4=\"\",\"\",INDEX('Irrig Sched'!$AX$9:$AX$39,MATCH(Z4,'Irrig Sched'!$AU$9:$AU$39,0)))","v":""},{"$f":"IF(AA4=\"\",\"\",INDEX('Irrig Sched'!$AX$9:$AX$39,MATCH(AA4,'Irrig Sched'!$AU$9:$AU$39,0)))","v":""},{"$f":"IF(AB4=\"\",\"\",INDEX('Irrig Sched'!$AX$9:$AX$39,MATCH(AB4,'Irrig Sched'!$AU$9:$AU$39,0)))","v":""}]
[{"$f":"IF(AND(YEAR(JanOffset+8)=CalendarYear,MONTH(JanOffset+8)=1),DAY(JanOffset+8),\"\")","v":"1900-01-08"},{"$f":"IF(AND(YEAR(JanOffset+9)=CalendarYear,MONTH(JanOffset+9)=1),DAY(JanOffset+9),\"\")","v":"1900-01-09"},{"$f":"IF(AND(YEAR(JanOffset+10)=CalendarYear,MONTH(JanOffset+10)=1),DAY(JanOffset+10),\"\")","v":"1900-01-10"},{"$f":"IF(AND(YEAR(JanOffset+11)=CalendarYear,MONTH(JanOffset+11)=1),DAY(JanOffset+11),\"\")","v":"1900-01-11"},{"$f":"IF(AND(YEAR(JanOffset+12)=CalendarYear,MONTH(JanOffset+12)=1),DAY(JanOffset+12),\"\")","v":"1900-01-12"},{"$f":"IF(AND(YEAR(JanOffset+13)=CalendarYear,MONTH(JanOffset+13)=1),DAY(JanOffset+13),\"\")","v":"1900-01-13"},{"$f":"IF(AND(YEAR(JanOffset+14)=CalendarYear,MONTH(JanOffset+14)=1),DAY(JanOffset+14),\"\")","v":"1900-01-14"},{"$f":"IF(AND(YEAR(AprOffset+8)=CalendarYear,MONTH(AprOffset+8)=4),DAY(AprOffset+8),\"\")","v":"1900-01-02"},{"$f":"IF(AND(YEAR(AprOffset+9)=CalendarYear,MONTH(AprOffset+9)=4),DAY(AprOffset+9),\"\")","v":"1900-01-03"},{"$f":"IF(AND(YEAR(AprOffset+10)=CalendarYear,MONTH(AprOffset+10)=4),DAY(AprOffset+10),\"\")","v":"1900-01-04"},{"$f":"IF(AND(YEAR(AprOffset+11)=CalendarYear,MONTH(AprOffset+11)=4),DAY(AprOffset+11),\"\")","v":"1900-01-05"},{"$f":"IF(AND(YEAR(AprOffset+12)=CalendarYear,MONTH(AprOffset+12)=4),DAY(AprOffset+12),\"\")","v":"1900-01-06"},{"$f":"IF(AND(YEAR(AprOffset+13)=CalendarYear,MONTH(AprOffset+13)=4),DAY(AprOffset+13),\"\")","v":"1900-01-07"},{"$f":"IF(AND(YEAR(AprOffset+14)=CalendarYear,MONTH(AprOffset+14)=4),DAY(AprOffset+14),\"\")","v":"1900-01-08"},{"$f":"IF(AND(YEAR(JulOffset+8)=CalendarYear,MONTH(JulOffset+8)=7),DAY(JulOffset+8),\"\")","v":"1900-01-02"},{"$f":"IF(AND(YEAR(JulOffset+9)=CalendarYear,MONTH(JulOffset+9)=7),DAY(JulOffset+9),\"\")","v":"1900-01-03"},{"$f":"IF(AND(YEAR(JulOffset+10)=CalendarYear,MONTH(JulOffset+10)=7),DAY(JulOffset+10),\"\")","v":"1900-01-04"},{"$f":"IF(AND(YEAR(JulOffset+11)=CalendarYear,MONTH(JulOffset+11)=7),DAY(JulOffset+11),\"\")","v":"1900-01-05"},{"$f":"IF(AND(YEAR(JulOffset+12)=CalendarYear,MONTH(JulOffset+12)=7),DAY(JulOffset+12),\"\")","v":"1900-01-06"},{"$f":"IF(AND(YEAR(JulOffset+13)=CalendarYear,MONTH(JulOffset+13)=7),DAY(JulOffset+13),\"\")","v":"1900-01-07"},{"$f":"IF(AND(YEAR(JulOffset+14)=CalendarYear,MONTH(JulOffset+14)=7),DAY(JulOffset+14),\"\")","v":"1900-01-08"},{"$f":"IF(AND(YEAR(OctOffset+8)=CalendarYear,MONTH(OctOffset+8)=10),DAY(OctOffset+8),\"\")","v":"1900-01-08"},{"$f":"IF(AND(YEAR(OctOffset+9)=CalendarYear,MONTH(OctOffset+9)=10),DAY(OctOffset+9),\"\")","v":"1900-01-09"},{"$f":"IF(AND(YEAR(OctOffset+10)=CalendarYear,MONTH(OctOffset+10)=10),DAY(OctOffset+10),\"\")","v":"1900-01-10"},{"$f":"IF(AND(YEAR(OctOffset+11)=CalendarYear,MONTH(OctOffset+11)=10),DAY(OctOffset+11),\"\")","v":"1900-01-11"},{"$f":"IF(AND(YEAR(OctOffset+12)=CalendarYear,MONTH(OctOffset+12)=10),DAY(OctOffset+12),\"\")","v":"1900-01-12"},{"$f":"IF(AND(YEAR(OctOffset+13)=CalendarYear,MONTH(OctOffset+13)=10),DAY(OctOffset+13),\"\")","v":"1900-01-13"},{"$f":"IF(AND(YEAR(OctOffset+14)=CalendarYear,MONTH(OctOffset+14)=10),DAY(OctOffset+14),\"\")","v":"1900-01-14"}]
{"$rows_left_out":40}
{"sheet":"ETo Zones Map","index":8,"n_rows":38,"n_cols":23,"rows_kept":38,"cut":false,"hidden":false,"merged":[[1,9,8,22],[37,9,41,22]]}
[]
[null,null,null,null,null,null,null,null,null,"Find your location on the map and identify the ETo zone.  Enter the ETo zone number in the ETo, Soil, C.C., Irr Info. page.  Locate the ETo zone in the chart below.  The numbers in the cells to the right of the zone number are the average monthly inches of irrgation needed to irrigate the reference crop.  These numbers are used in calculating the irrigation calendar to guide you in adjusting your controller to match the water demand of the plants in your landscape."]
[]
[]
[]
[]
{"$rows_left_out":33}
{"sheet":"SOIL INFORMATION","index":9,"n_rows":20,"n_cols":5,"rows_kept":20,"cut":false,"hidden":true,"merged":[[4,0,4,1],[2,4,4,4],[2,3,4,3],[2,2,4,2]]}
["Soil Information"]
[]
["Depth to wet (in.):",{"$f":"Depth_To_Wet","v":12},"Infiltration*\n(in./hr)","Plant Avail Water (cm/cm)**","Irrig to wet to depth \n(in)†"]
[]
["Soil Texture "]
["Coarse ","sand / fine sand",1.5,0.05,{"$f":"$B$3*D6*0.5","v":0.30000000000000004}]
{"$rows_left_out":15}
{"sheet":"DU CALCS \"mL.\"","index":10,"n_rows":51,"n_cols":13,"rows_kept":51,"cut":false,"hidden":true,"merged":[[0,0,0,5],[3,0,3,2],[4,0,4,2],[1,0,1,5],[48,0,48,1],[52,0,52,1],[53,0,53,1],[50,0,50,1],[49,0,49,1],[50,3,50,4]]}
["System Efficiency and Watering Schedule  "]
["Determine values for each of the sections below and enter values into the fields provided.\nNote:  fields highlighted in  green must be filled out in order for other calculations in the spread sheet to work properly."]
[]
["Catch can throat area (sq. in) use: πr2 ",null,null,{"$f":"Throat_area","v":16.600000000000001}]
["Elapsed Time (Minutes):",null,null,{"$f":"Runtime","v":6}]
[null,null,null,null,null,null,null,null,null,null,"% applied target:",0.9]
{"$rows_left_out":46}
{"sheet":"DAILY ETo","index":11,"n_rows":25,"n_cols":18,"rows_kept":25,"cut":false,"hidden":true,"merged":[[3,10,4,10],[3,3,3,5],[3,9,4,9],[3,8,4,8]]}
[]
[]
[]
[null,null,null,"Run time",null,null,null,null,"ModifiedDaily ETo (in.)","no. days between irr"]
["Month","Monthly ETo","ETo x KL","Monthly (min/mo)","Weekly (min/wk)","Daily (min/da)","no. irrig\n/mo","no.days /mo",null,null,null,"Year",{"$f":"'ETo, Soil, C.C., Irr Info.'!D31","v":2017},null,"DayOfWeek and Designated days"]
["Jan",{"$f":"VLOOKUP(ETo_Zone,ETo_Zone_Chart,2)","v":1.55},{"$f":"B6*KL","v":0.92999999999999994},{"$f":"(B6*KL*60)/PR*SM","v":69.655587306361852},{"$f":"ROUND(D6/H6*7,0)","v":16},{"$f":"ROUND(D6/H6,0)","v":2},{"$f":"ROUND(D6/Time_to_wet_d,0)","v":2},31,{"$f":"C6/H6","v":0.03},{"$f":"in_to_wet_d/I6","v":22.000000000000004},null,"JanOffset",{"$f":"DATE(CalendarYear,1,1)-WEEKDAY(DATE(CalendarYear,1,1))","v":"2016-12-31"},null,1,"Sun",{"$f":"IF(R6=FALSE,0,1)","v":0},false]
{"$rows_left_out":20}
{"sheet":"Irrig Sched","index":12,"n_rows":39,"n_cols":60,"rows_kept":39,"cut":false,"hidden":true,"merged":[[7,50,7,54],[7,55,7,59],[7,0,7,4],[7,5,7,9],[7,10,7,14],[7,15,7,19],[7,20,7,24],[7,25,7,29],[7,30,7,34],[7,35,7,39],[7,40,7,44],[7,45,7,49]]}
["Irrigation schedule"]
["Days of each month to run irrigation cycle"]
[]
[null,null,null,null,"Irrig year: ",{"$f":"Irrig_Year","v":2017},{"$f":"IF(OR(MOD(Irrig_Year,400)=0,AND(MOD(Irrig_Year,4)=0,MOD(Irrig_Year,100)<>0)),\" is a Leap Year\", \" is NOT a Leap Year\")","v":" is NOT a Leap Year"}]
[null,null,null,null,"Amount applied: ",{"$f":"Amt_Applied","v":0.64653061224489794}," In."]
[]
{"$rows_left_out":33}